program: Orca
programVersion: 5.0.4
elementType: S P O O O O N C C C C C C C C C C C C C H H H H H H H H H H H H H H H H
charge: 0
multiplicity: 1
keywords: wb97x-d3
keywords: def2-TZVPP
keywords: def2/J RIJCOSX
keywords: DEFGRID2
keywords: scfconv7
keywords: smallprint printgap noloewdin
keywords: NOSOSCF
formula: C13H16NO4PS
InChI: InChI=1/C13H16NO4PS/c1-3-15-19(20,16-4-2)18-13-10-12(17-14-13)11-8-6-5-7-9-11/h5-10H,3-4H2,1-2H3
36 atoms
S  -3.94352 -0.46138 1.573427
P  -2.554739 -0.301768 0.281406
O  -1.174241 0.179459 1.038752
O  -2.74246 0.701217 -0.930077
O  -2.119141 -1.583944 -0.553209
O  1.458061 1.242872 -0.844822
N  0.126704 1.213456 -0.579199
C  2.12584 0.476933 0.021405
C  3.571728 0.393674 -0.118018
C  0.002918 0.420699 0.44166
C  1.243518 -0.088675 0.885061
C  -3.090108 2.072896 -0.685054
C  -2.253643 -2.907602 -0.023055
C  4.341219 -0.091438 0.938553
C  4.205064 0.789505 -1.295717
C  5.716393 -0.184619 0.81917
C  5.581753 0.694277 -1.409645
C  -2.930409 2.834212 -1.976035
C  -1.207948 -3.218812 1.024742
C  6.341144 0.207271 -0.356268
H  1.423759 -0.768742 1.698718
H  -4.117198 2.114219 -0.315103
H  -2.438073 2.496341 0.083025
H  -3.259436 -3.038403 0.38279
H  -2.147371 -3.563574 -0.88586
H  3.864691 -0.382957 1.865675
H  3.624758 1.166217 -2.126873
H  -1.8966 2.800841 -2.31553
H  -3.572018 2.43148 -2.758926
H  -3.206542 3.876831 -1.817973
H  -1.359193 -2.630863 1.930136
H  -1.274381 -4.271049 1.30234
H  -0.202065 -3.03445 0.647038
H  6.302463 -0.558407 1.647918
H  6.0633 1.002032 -2.328035
H  7.416511 0.135949 -0.449343
totalener: -1600.36739728 hartree
nucrepener: 1872.93532046 hartree
electener: -3473.30271775 hartree
oneelecener: -5918.89501074 hartree
twoeener: 2445.59229299 hartree
kineticenergy: 1595.32493374 hartree
xcener: -117.836685424227 hartree
chargesum: -0.0000000
charge: -0.365271 0.682586 -0.318395 -0.289970 -0.305565 -0.138055 -0.168826 0.370313 -0.002570 0.280911 -0.282309 -0.013485 0.021413 -0.164179 -0.166044 -0.136645 -0.130254 -0.232831 -0.253543 -0.099081 0.139514 0.112839 0.105547 0.094632 0.097823 0.116178 0.133644 0.097009 0.083844 0.073371 0.094492 0.093653 0.081688 0.128133 0.129101 0.130334
qa: -0.3653 0.6826 -0.3184 -0.2900 -0.3056 -0.1381 -0.1688 0.3703 -0.0026 0.2809 -0.2823 -0.0135 0.0214 -0.1642 -0.1660 -0.1366 -0.1303 -0.2328 -0.2535 -0.0991 0.1395 0.1128 0.1055 0.0946 0.0978 0.1162 0.1336 0.0970 0.0838 0.0734 0.0945 0.0937 0.0817 0.1281 0.1291 0.1303
va: 2.0833 5.5441 2.1272 2.1570 2.1306 2.2709 2.8058 3.6761 3.7286 4.1238 3.9371 3.8691 3.8834 4.0019 4.0119 3.9892 3.9647 3.9491 3.8891 3.9527 1.0050 1.0043 0.9930 1.0142 0.9922 1.0148 1.0212 1.0118 1.0055 1.0078 1.0152 1.0147 1.0037 1.0031 1.0031 0.9990
dispcorr: -0.015895952 hartree
energy: -1600.383293234892
dipole: 6.67529 -4.97657 1.69872 -2.51412 1.98016 -0.53396 -3.82367 3.70993 -0.11374
magnitude: 1.78429 au
magnitude: 4.53530 debye
