program: Orca
programVersion: 5.0.4
elementType: S P O O O O N C C C C C C C C C C C C C H H H H H H H H H H H H H H H H
charge: 0
multiplicity: 1
keywords: wb97x-d3
keywords: def2-TZVPP
keywords: def2/J RIJCOSX
keywords: DEFGRID2
keywords: scfconv7
keywords: smallprint printgap noloewdin
keywords: NOSOSCF
formula: C13H16NO4PS
InChI: InChI=1/C13H16NO4PS/c1-3-15-19(20,16-4-2)18-13-10-12(17-14-13)11-8-6-5-7-9-11/h5-10H,3-4H2,1-2H3
36 atoms
S  -4.064182 -0.517952 1.000067
P  -2.278312 -0.461609 0.34301
O  -1.187278 -0.286108 1.531976
O  -1.910281 0.689927 -0.701056
O  -1.70366 -1.748495 -0.399895
O  1.995321 0.803134 1.891908
N  0.718041 0.64201 2.321977
C  2.144462 0.297397 0.666211
C  3.457913 0.388749 0.045459
C  0.109198 0.031189 1.352456
C  0.961226 -0.224749 0.251825
C  -2.455701 2.014874 -0.579775
C  -2.537932 -2.613486 -1.181621
C  3.604446 0.093159 -1.309598
C  4.579604 0.769228 0.782094
C  4.845221 0.174061 -1.915915
C  5.819241 0.850307 0.169725
C  -3.58544 2.213903 -1.56183
C  -2.922508 -2.003879 -2.510542
C  5.957631 0.553753 -1.177925
H  0.734619 -0.728954 -0.669874
H  -2.798982 2.19994 0.440935
H  -1.627596 2.694632 -0.779916
H  -1.946656 -3.517209 -1.322871
H  -3.426036 -2.877078 -0.602998
H  2.741379 -0.190747 -1.897857
H  4.488599 0.999018 1.834864
H  -3.943001 3.242344 -1.505819
H  -3.259061 2.027349 -2.584819
H  -4.421599 1.554615 -1.331934
H  -3.462169 -2.743196 -3.102993
H  -3.577733 -1.14224 -2.384234
H  -2.045764 -1.6921 -3.077065
H  4.943922 -0.055534 -2.968453
H  6.682512 1.146017 0.750676
H  6.927734 0.618964 -1.652202
totalener: -1600.36646422 hartree
nucrepener: 1876.04356903 hartree
electener: -3476.41003325 hartree
oneelecener: -5924.70370182 hartree
twoeener: 2448.29366856 hartree
kineticenergy: 1595.31453877 hartree
xcener: -117.837702719248 hartree
chargesum: -0.0000000
charge: -0.344688 0.661607 -0.273265 -0.312139 -0.308502 -0.122514 -0.146914 0.303796 0.007643 0.205575 -0.211833 0.022191 -0.002932 -0.175735 -0.159052 -0.125167 -0.126051 -0.233001 -0.216174 -0.105688 0.129462 0.097394 0.096515 0.096260 0.098608 0.112795 0.136040 0.089347 0.084679 0.085366 0.088664 0.078515 0.085038 0.126226 0.128814 0.129120
qa: -0.3447 0.6616 -0.2733 -0.3121 -0.3085 -0.1225 -0.1469 0.3038 0.0076 0.2056 -0.2118 0.0222 -0.0029 -0.1757 -0.1591 -0.1252 -0.1261 -0.2330 -0.2162 -0.1057 0.1295 0.0974 0.0965 0.0963 0.0986 0.1128 0.1360 0.0893 0.0847 0.0854 0.0887 0.0785 0.0850 0.1262 0.1288 0.1291
va: 2.1048 5.5321 2.1984 2.0626 2.1096 2.2613 2.8270 3.7697 3.7314 4.2407 3.9143 3.8754 3.9048 4.0116 4.0049 3.9783 3.9589 3.9168 3.8913 3.9575 1.0258 1.0057 0.9954 0.9925 1.0122 1.0155 1.0203 1.0146 1.0025 1.0208 1.0129 1.0156 1.0059 1.0030 1.0031 0.9994
dispcorr: -0.015990663 hartree
energy: -1600.382454887157
dipole: -1.63762 2.43668 0.79907 1.79448 -1.87077 -0.07628 -20.19884 17.96570 -2.23313
magnitude: 2.37302 au
magnitude: 6.03173 debye
