program: Orca
programVersion: 5.0.4
elementType: S P O O O O N C C C C C C C C C C C C C H H H H H H H H H H H H H H H H
charge: 0
multiplicity: 1
keywords: wb97x-d3
keywords: def2-TZVPP
keywords: def2/J RIJCOSX
keywords: DEFGRID2
keywords: scfconv7
keywords: smallprint printgap noloewdin
keywords: NOSOSCF
formula: C13H16NO4PS
InChI: InChI=1/C13H16NO4PS/c1-3-15-19(20,16-4-2)18-13-10-12(17-14-13)11-8-6-5-7-9-11/h5-10H,3-4H2,1-2H3
36 atoms
S  -4.017947 0.168194 1.592124
P  -2.386752 -0.096318 0.647795
O  -1.191021 0.867051 1.205217
O  -2.391151 0.16043 -0.924231
O  -1.678555 -1.520947 0.729737
O  1.484322 1.61333 -0.754372
N  0.176999 1.74047 -0.421894
C  2.093445 0.74619 0.061253
C  3.507067 0.484689 -0.164317
C  0.005764 0.948508 0.591695
C  1.190338 0.274741 0.9596
C  -2.982327 1.35643 -1.460387
C  -2.427843 -2.729171 0.914853
C  4.259758 -0.151798 0.821891
C  4.125548 0.856115 -1.3584
C  5.602293 -0.416658 0.617327
C  5.469569 0.589259 -1.557486
C  -2.567634 1.474201 -2.904762
C  -3.216786 -3.116577 -0.315209
C  6.211504 -0.047551 -0.573571
H  1.320959 -0.447593 1.745455
H  -4.067159 1.288718 -1.353536
H  -2.641618 2.229267 -0.898997
H  -1.6809 -3.484916 1.15448
H  -3.086847 -2.616719 1.778773
H  3.798269 -0.429065 1.760921
H  3.557812 1.347604 -2.136766
H  -2.889899 0.610331 -3.485536
H  -3.024075 2.362217 -3.341703
H  -1.486562 1.572469 -2.988009
H  -3.666111 -4.098013 -0.162543
H  -4.024253 -2.411414 -0.510226
H  -2.579295 -3.16897 -1.196671
H  6.176466 -0.907189 1.391901
H  5.93875 0.879293 -2.488094
H  7.26152 -0.253772 -0.73257
totalener: -1600.36848230 hartree
nucrepener: 1873.17763313 hartree
electener: -3473.54611543 hartree
oneelecener: -5919.40574832 hartree
twoeener: 2445.85963289 hartree
kineticenergy: 1595.32151335 hartree
xcener: -117.835863453662 hartree
chargesum: 0.0000000
charge: -0.356731 0.675003 -0.315815 -0.302168 -0.312474 -0.132380 -0.169190 0.345621 0.011049 0.265249 -0.250763 -0.000391 0.002754 -0.164831 -0.165247 -0.131861 -0.126554 -0.227510 -0.221406 -0.102394 0.133731 0.107809 0.110523 0.092391 0.094993 0.115636 0.132441 0.081268 0.074889 0.093199 0.083387 0.083886 0.090097 0.127385 0.128660 0.129742
qa: -0.3567 0.6750 -0.3158 -0.3022 -0.3125 -0.1324 -0.1692 0.3456 0.0110 0.2652 -0.2508 -0.0004 0.0028 -0.1648 -0.1652 -0.1319 -0.1266 -0.2275 -0.2214 -0.1024 0.1337 0.1078 0.1105 0.0924 0.0950 0.1156 0.1324 0.0813 0.0749 0.0932 0.0834 0.0839 0.0901 0.1274 0.1287 0.1297
va: 2.0913 5.5429 2.1711 2.0880 2.1176 2.2673 2.8122 3.6764 3.7340 4.1525 3.9922 3.8518 3.9133 4.0057 4.0110 3.9850 3.9612 3.9549 3.8780 3.9559 1.0090 1.0078 0.9949 0.9914 1.0103 1.0148 1.0212 1.0048 1.0089 1.0110 1.0115 1.0233 1.0068 1.0030 1.0030 0.9992
dispcorr: -0.015571998 hartree
energy: -1600.384054301438
dipole: 1.45327 -0.10931 1.34396 -8.77730 7.65897 -1.11833 -11.61669 11.07148 -0.54521
magnitude: 1.83143 au
magnitude: 4.65513 debye
