program: Orca
programVersion: 5.0.4
elementType: S P O O O O N C C C C C C C C C C C C C H H H H H H H H H H H H H H H H
charge: 0
multiplicity: 1
keywords: wb97x-d3
keywords: def2-TZVPP
keywords: def2/J RIJCOSX
keywords: DEFGRID2
keywords: scfconv7
keywords: smallprint printgap noloewdin
keywords: NOSOSCF
formula: C13H16NO4PS
InChI: InChI=1/C13H16NO4PS/c1-3-15-19(20,16-4-2)18-13-10-12(17-14-13)11-8-6-5-7-9-11/h5-10H,3-4H2,1-2H3
36 atoms
S  -1.811827 0.135834 1.726622
P  -2.405601 -0.032436 -0.085371
O  -1.282631 0.383044 -1.203534
O  -3.597109 0.883996 -0.58949
O  -2.918464 -1.448743 -0.57121
O  1.845495 -0.925201 -1.340116
N  0.529705 -0.941535 -1.666621
C  2.116731 0.101849 -0.527664
C  3.488447 0.268315 -0.072935
C  0.019078 0.079476 -1.04971
C  0.973122 0.796108 -0.296817
C  -3.588561 2.299039 -0.347837
C  -2.829924 -2.641182 0.225296
C  3.822655 1.365168 0.720921
C  4.480091 -0.652166 -0.410967
C  5.119313 1.53799 1.169869
C  5.777048 -0.474288 0.041148
C  -4.500336 2.651402 0.803877
C  -1.458503 -3.270243 0.157157
C  6.101567 0.617789 0.831748
H  0.808708 1.660266 0.321102
H  -2.57356 2.65674 -0.15422
H  -3.924205 2.759972 -1.276645
H  -3.103346 -2.415358 1.258122
H  -3.588324 -3.303965 -0.189191
H  3.065794 2.090532 0.989596
H  4.242603 -1.509973 -1.024919
H  -4.535857 3.734714 0.923271
H  -5.515895 2.299272 0.626239
H  -4.138861 2.219186 1.735859
H  -0.710741 -2.648205 0.647917
H  -1.478946 -4.232462 0.670207
H  -1.145344 -3.437296 -0.872165
H  5.363955 2.393429 1.785034
H  6.537949 -1.1953 -0.225798
H  7.115799 0.752099 1.183203
totalener: -1600.36758292 hartree
nucrepener: 1880.86507822 hartree
electener: -3481.23266114 hartree
oneelecener: -5934.83439853 hartree
twoeener: 2453.60173738 hartree
kineticenergy: 1595.33098578 hartree
xcener: -117.840656757908 hartree
chargesum: 0.0000000
charge: -0.396829 0.701327 -0.316282 -0.307656 -0.303899 -0.124565 -0.157513 0.344881 0.001036 0.239334 -0.228502 0.024737 0.035066 -0.168294 -0.167062 -0.122685 -0.120390 -0.223659 -0.237660 -0.107164 0.129180 0.074705 0.096741 0.088092 0.097909 0.113602 0.134673 0.079182 0.087181 0.084305 0.079575 0.086959 0.100172 0.126815 0.127372 0.129314
qa: -0.3968 0.7013 -0.3163 -0.3077 -0.3039 -0.1246 -0.1575 0.3449 0.0010 0.2393 -0.2285 0.0247 0.0351 -0.1683 -0.1671 -0.1227 -0.1204 -0.2237 -0.2377 -0.1072 0.1292 0.0747 0.0967 0.0881 0.0979 0.1136 0.1347 0.0792 0.0872 0.0843 0.0796 0.0870 0.1002 0.1268 0.1274 0.1293
va: 2.0164 5.5442 2.1332 2.1525 2.1540 2.2535 2.8055 3.7256 3.7535 4.1520 3.9832 3.9270 3.8613 4.0054 4.0086 3.9765 3.9533 3.9183 3.8961 3.9575 1.0167 1.0021 0.9943 1.0133 0.9929 1.0153 1.0213 1.0107 1.0053 1.0220 1.0186 1.0118 1.0092 1.0029 1.0034 0.9993
dispcorr: -0.015924711 hartree
energy: -1600.383507635083
dipole: -1.71374 2.13100 0.41726 1.42206 -0.76969 0.65237 6.34873 -5.81549 0.53324
magnitude: 0.94023 au
magnitude: 2.38988 debye
