program: Orca
programVersion: 5.0.3
elementType: O O N C C C C C C C C C C C H H H H H H H H H H H H H H H
charge: 0
multiplicity: 1
keywords: wb97x-d3
keywords: def2-TZVPP
keywords: def2/J RIJCOSX
keywords: DEFGRID2
keywords: scfconv7
keywords: smallprint printgap noloewdin
keywords: NOSOSCF
formula: C11H15NO2
InChI: InChI=1/C11H15NO2/c1-8(2)9-6-4-5-7-10(9)14-11(13)12-3/h4-8,12H,1-3H3
29 atoms
O  0.900407 0.462305 0.890226
O  1.502757 0.537228 -1.289949
N  3.044852 0.289365 0.356225
C  -0.719056 -1.837511 0.112383
C  -1.23021 -0.415763 0.184905
C  -0.826666 -2.386207 -1.309299
C  -1.453999 -2.73659 1.105081
C  -0.425295 0.663287 0.535973
C  -2.564719 -0.132374 -0.1115
C  -0.908281 1.961774 0.593984
C  -3.067533 1.157777 -0.059856
C  -2.237602 2.21212 0.298468
C  1.8084 0.43504 -0.117089
C  4.183648 0.188564 -0.526945
H  0.336333 -1.852222 0.390181
H  -1.865947 -2.456197 -1.634733
H  -0.39591 -3.38704 -1.364518
H  -0.293421 -1.754873 -2.021033
H  -1.351545 -2.369814 2.126958
H  -1.046873 -3.748394 1.073291
H  -2.519358 -2.803909 0.878001
H  -3.225347 -0.943373 -0.39402
H  -0.242358 2.767782 0.875698
H  -4.10744 1.340209 -0.29661
H  -2.619655 3.22311 0.344512
H  3.180821 0.173184 1.348163
H  5.084804 0.195065 0.078928
H  4.232752 1.03425 -1.210982
H  4.171122 -0.73292 -1.110119
elementType: O N C H
totalener: -633.50640170 hartree
nucrepener: 910.71025195 hartree
electener: -1544.21665365 hartree
oneelecener: -2668.11934905 hartree
twoeener: 1123.90269540 hartree
cpcmener: -0.02939878 hartree
kineticenergy: 630.68092389 hartree
xcener: -61.561064416958 hartree
chargesum: -0.0000000
charge: -0.346248 -0.551771 -0.218400 0.070854 0.045753 -0.278061 -0.290362 0.144653 -0.194730 -0.145919 -0.170051 -0.174196 0.526008 -0.163178 0.042520 0.086486 0.097143 0.091877 0.099624 0.095481 0.087059 0.146031 0.151106 0.159943 0.161174 0.188339 0.115469 0.108823 0.114573
qa: -0.3462 -0.5518 -0.2184 0.0709 0.0458 -0.2781 -0.2904 0.1447 -0.1947 -0.1459 -0.1701 -0.1742 0.5260 -0.1632 0.0425 0.0865 0.0971 0.0919 0.0996 0.0955 0.0871 0.1460 0.1511 0.1599 0.1612 0.1883 0.1155 0.1088 0.1146
va: 2.0662 1.9487 3.2131 3.7930 3.5656 3.9100 3.9289 3.7781 3.9241 3.9803 3.9135 3.9017 4.2375 3.9012 1.0306 1.0033 1.0035 1.0149 1.0031 1.0029 1.0036 1.0000 0.9978 0.9904 0.9885 1.0063 0.9977 0.9935 0.9887
dispcorr: -0.011795408 hartree
energy: -633.518197103757
dipole: 0.08442 0.81280 0.89722 -10.44961 10.00776 -0.44185 -1.31270 2.59932 1.28662
magnitude: 1.62961 au
magnitude: 4.14214 debye
