program: Orca
programVersion: 5.0.3
elementType: O O N C C C C C C C C C C C H H H H H H H H H H H H H H H
charge: 0
multiplicity: 1
keywords: wb97x-d3
keywords: def2-TZVPP
keywords: def2/J RIJCOSX
keywords: DEFGRID2
keywords: scfconv7
keywords: smallprint printgap noloewdin
keywords: NOSOSCF
formula: C11H15NO2
InChI: InChI=1/C11H15NO2/c1-8(2)9-6-4-5-7-10(9)14-11(13)12-3/h4-8,12H,1-3H3
29 atoms
O  0.747247 0.227707 -0.734127
O  1.581275 0.640967 1.327868
N  2.939919 0.169738 -0.429932
C  -1.172313 -1.925683 -0.172522
C  -1.455385 -0.442951 -0.050939
C  -0.071421 -2.435225 0.757898
C  -0.918031 -2.350816 -1.618089
C  -0.527599 0.562525 -0.311672
C  -2.737245 -0.026513 0.313023
C  -0.849385 1.908281 -0.220213
C  -3.078449 1.313188 0.416267
C  -2.130277 2.288475 0.144695
C  1.759688 0.368723 0.156992
C  4.172222 0.157614 0.322908
H  -2.095351 -2.420656 0.141391
H  -0.118742 -3.523875 0.813436
H  -0.185863 -2.05106 1.771814
H  0.9290 -2.184693 0.406704
H  0.019126 -1.953003 -2.006981
H  -1.722401 -2.021861 -2.276993
H  -0.863166 -3.438788 -1.684065
H  -3.486268 -0.780961 0.521576
H  -0.097958 2.655081 -0.445769
H  -4.083789 1.592973 0.70207
H  -2.381857 3.338171 0.215684
H  2.961009 -0.119696 -1.395274
H  4.226262 1.00818 0.998553
H  5.001196 0.231258 -0.374271
H  4.291312 -0.758132 0.903201
elementType: O N C H
totalener: -633.50458680 hartree
nucrepener: 917.08756101 hartree
electener: -1550.59214781 hartree
oneelecener: -2680.81546067 hartree
twoeener: 1130.22331285 hartree
cpcmener: -0.02939811 hartree
kineticenergy: 630.68840802 hartree
xcener: -61.561788016551 hartree
chargesum: -0.0000000
charge: -0.339940 -0.543465 -0.213093 0.092047 0.010405 -0.311819 -0.293850 0.146520 -0.166200 -0.153422 -0.153790 -0.168939 0.501942 -0.158521 0.042116 0.107522 0.101535 0.080228 0.085780 0.097892 0.097302 0.137846 0.154842 0.159524 0.161775 0.188451 0.106011 0.116207 0.115093
qa: -0.3399 -0.5435 -0.2131 0.0920 0.0104 -0.3118 -0.2939 0.1465 -0.1662 -0.1534 -0.1538 -0.1689 0.5019 -0.1585 0.0421 0.1075 0.1015 0.0802 0.0858 0.0979 0.0973 0.1378 0.1548 0.1595 0.1618 0.1885 0.1060 0.1162 0.1151
va: 2.0623 1.9562 3.2195 3.7670 3.6315 3.9369 3.9279 3.7867 3.9111 3.9832 3.8853 3.8989 4.2687 3.8973 1.0179 1.0029 1.0063 1.0041 1.0087 1.0028 1.0023 1.0032 0.9954 0.9903 0.9887 1.0047 0.9985 0.9974 0.9877
dispcorr: -0.012392637 hartree
energy: -633.516979437972
dipole: 2.53835 -1.85430 0.68405 -9.67885 9.08403 -0.59481 -1.49552 0.11693 -1.37860
magnitude: 1.64993 au
magnitude: 4.19378 debye
