program: Orca
programVersion: 5.0.3
elementType: O O N C C C C C C C C C C C H H H H H H H H H H H H H H H
charge: 0
multiplicity: 1
keywords: wb97x-d3
keywords: def2-TZVPP
keywords: def2/J RIJCOSX
keywords: DEFGRID2
keywords: scfconv7
keywords: smallprint printgap noloewdin
keywords: NOSOSCF
formula: C11H15NO2
InChI: InChI=1/C11H15NO2/c1-8(2)9-6-4-5-7-10(9)14-11(13)12-3/h4-8,12H,1-3H3
29 atoms
O  0.873943 0.421255 -0.792154
O  1.689833 0.749719 1.29006
N  3.05253 0.294651 -0.478912
C  -0.800542 -1.866176 -0.380373
C  -1.274006 -0.440994 -0.191294
C  -1.853879 -2.761758 -1.026109
C  -0.345619 -2.449577 0.958905
C  -0.417222 0.645025 -0.355231
C  -2.583612 -0.154311 0.19537
C  -0.831903 1.952966 -0.155375
C  -3.015059 1.146005 0.407166
C  -2.138205 2.206258 0.228292
C  1.876827 0.509508 0.117281
C  4.319642 0.33898 0.205923
H  0.063623 -1.85418 -1.048332
H  -1.424967 -3.74098 -1.244787
H  -2.219967 -2.344959 -1.96565
H  -2.71345 -2.928256 -0.374981
H  0.038636 -3.463127 0.827882
H  -1.175989 -2.496606 1.666684
H  0.444398 -1.852603 1.415867
H  -3.286421 -0.965521 0.336788
H  -0.135651 2.767821 -0.311095
H  -4.03871 1.330551 0.706459
H  -2.466442 3.225317 0.385843
H  3.058347 0.103511 -1.468942
H  4.172169 0.58926 1.25238
H  4.970019 1.094011 -0.236389
H  4.825433 -0.625443 0.153311
elementType: O N C H
totalener: -633.51013828 hartree
nucrepener: 908.55133836 hartree
electener: -1542.06147664 hartree
oneelecener: -2663.55957257 hartree
twoeener: 1121.49809593 hartree
cpcmener: -0.02286879 hartree
kineticenergy: 630.68794813 hartree
xcener: -61.562471585699 hartree
chargesum: 0.0000000
charge: -0.339610 -0.513218 -0.208633 0.073889 0.038980 -0.287653 -0.291541 0.135012 -0.192409 -0.134360 -0.159093 -0.173072 0.481149 -0.141959 0.047592 0.096537 0.103144 0.081882 0.093948 0.090356 0.091227 0.146042 0.147660 0.155742 0.157258 0.177799 0.102404 0.111197 0.109730
qa: -0.3396 -0.5132 -0.2086 0.0739 0.0390 -0.2877 -0.2915 0.1350 -0.1924 -0.1344 -0.1591 -0.1731 0.4811 -0.1420 0.0476 0.0965 0.1031 0.0819 0.0939 0.0904 0.0912 0.1460 0.1477 0.1557 0.1573 0.1778 0.1024 0.1112 0.1097
va: 2.0666 1.9984 3.2040 3.7804 3.6251 3.9153 3.9188 3.8353 3.9328 3.9867 3.9187 3.9115 4.2933 3.8797 1.0268 1.0030 1.0026 1.0033 1.0032 1.0025 1.0196 0.9962 0.9966 0.9921 0.9900 1.0103 1.0182 0.9918 0.9914
dispcorr: -0.011745615 hartree
energy: -633.521883893356
dipole: 0.22854 0.54145 0.76999 -10.53346 10.03495 -0.49851 -0.00893 -1.28195 -1.29088
magnitude: 1.58359 au
magnitude: 4.02517 debye
