program: Orca
programVersion: 5.0.3
elementType: O O N C C C C C C C C C C C H H H H H H H H H H H H H H H
charge: 0
multiplicity: 1
keywords: wb97x-d3
keywords: def2-TZVPP
keywords: def2/J RIJCOSX
keywords: DEFGRID2
keywords: scfconv7
keywords: smallprint printgap noloewdin
keywords: NOSOSCF
formula: C11H15NO2
InChI: InChI=1/C11H15NO2/c1-8(2)9-6-4-5-7-10(9)14-11(13)12-3/h4-8,12H,1-3H3
29 atoms
O  0.889766 0.424236 0.79321
O  1.610627 0.787836 -1.314306
N  3.046769 0.227956 0.364969
C  -0.666266 -1.826521 -0.030414
C  -1.209692 -0.414022 -0.002515
C  -1.380272 -2.729751 -1.030074
C  -0.714783 -2.43497 1.372603
C  -0.413634 0.658303 0.397561
C  -2.535185 -0.123415 -0.321563
C  -0.892095 1.955091 0.466477
C  -3.03638 1.169432 -0.254406
C  -2.214894 2.213977 0.141346
C  1.850432 0.504363 -0.160738
C  4.273457 0.244662 -0.391272
H  0.381372 -1.789618 -0.340154
H  -0.845485 -3.676866 -1.11807
H  -1.42257 -2.285117 -2.026006
H  -2.401039 -2.966294 -0.723399
H  -1.745169 -2.514884 1.725916
H  -0.160514 -1.838001 2.098116
H  -0.284076 -3.43828 1.374238
H  -3.195997 -0.9208 -0.636868
H  -0.232673 2.755047 0.780518
H  -4.070766 1.358135 -0.511842
H  -2.596031 3.225549 0.193843
H  3.100728 0.017504 1.349694
H  4.070016 0.479568 -1.43204
H  4.765638 -0.72729 -0.352403
H  4.961517 0.995403 -0.001637
elementType: O N C H
totalener: -633.51038829 hartree
nucrepener: 909.91883458 hartree
electener: -1543.42922288 hartree
oneelecener: -2666.31105136 hartree
twoeener: 1122.88182848 hartree
cpcmener: -0.02330291 hartree
kineticenergy: 630.68688291 hartree
xcener: -61.562073158701 hartree
chargesum: -0.0000000
charge: -0.346403 -0.512244 -0.210734 0.071135 0.022621 -0.293615 -0.287025 0.166117 -0.184484 -0.154627 -0.161887 -0.166410 0.476043 -0.142529 0.044962 0.100695 0.108940 0.083421 0.091293 0.091489 0.095595 0.144898 0.147903 0.155874 0.156657 0.178628 0.102615 0.110434 0.110636
qa: -0.3464 -0.5122 -0.2107 0.0711 0.0226 -0.2936 -0.2870 0.1661 -0.1845 -0.1546 -0.1619 -0.1664 0.4760 -0.1425 0.0450 0.1007 0.1089 0.0834 0.0913 0.0915 0.0956 0.1449 0.1479 0.1559 0.1567 0.1786 0.1026 0.1104 0.1106
va: 2.0564 2.0013 3.1991 3.8130 3.6861 3.9094 3.9132 3.7649 3.9198 4.0065 3.9212 3.9129 4.3057 3.8796 1.0192 1.0023 1.0023 1.0015 1.0029 1.0087 1.0031 0.9972 0.9981 0.9923 0.9900 1.0088 1.0182 0.9915 0.9914
dispcorr: -0.011640281 hartree
energy: -633.522028575239
dipole: 0.38349 0.43007 0.81356 -10.73544 10.13285 -0.60259 0.39422 0.79938 1.19360
magnitude: 1.56514 au
magnitude: 3.97827 debye
