program: Orca
programVersion: 5.0.3
elementType: O O N C C C C C C C C C C C H H H H H H H H H H H H H H H
charge: 0
multiplicity: 1
keywords: wb97x-d3
keywords: def2-TZVPP
keywords: def2/J RIJCOSX
keywords: DEFGRID2
keywords: scfconv7
keywords: smallprint printgap noloewdin
keywords: NOSOSCF
formula: C11H15NO2
InChI: InChI=1/C11H15NO2/c1-8(2)9-6-4-5-7-10(9)14-11(13)12-3/h4-8,12H,1-3H3
29 atoms
O  0.800056 0.351136 -0.824753
O  1.750405 0.871802 1.158437
N  2.999918 0.26088 -0.639919
C  -0.773003 -1.880658 -0.014802
C  -1.26748 -0.452287 0.068239
C  -0.932933 -2.408642 -1.442303
C  -1.45566 -2.816316 0.976712
C  -0.460875 0.61356 -0.327195
C  -2.559342 -0.137235 0.48668
C  -0.899152 1.92694 -0.299525
C  -3.018846 1.17161 0.517892
C  -2.188054 2.209289 0.123699
C  1.859244 0.523811 0.00367
C  4.28092 0.292001 0.019744
H  0.29342 -1.889339 0.226768
H  -0.403724 -1.792204 -2.169844
H  -1.985551 -2.4344 -1.731948
H  -0.540738 -3.424243 -1.524043
H  -2.511643 -2.969521 0.745993
H  -1.383714 -2.448235 2.00184
H  -0.978127 -3.797384 0.946464
H  -3.227175 -0.92836 0.80145
H  -0.237033 2.722313 -0.618878
H  -4.028234 1.378398 0.849246
H  -2.536922 3.233414 0.145649
H  2.953389 -0.105485 -1.577148
H  4.484462 -0.62462 0.574894
H  4.343225 1.132379 0.70694
H  5.056266 0.417159 -0.730324
elementType: O N C H
totalener: -633.51077561 hartree
nucrepener: 907.19989167 hartree
electener: -1540.71066728 hartree
oneelecener: -2660.80211556 hartree
twoeener: 1120.09144829 hartree
cpcmener: -0.02371577 hartree
kineticenergy: 630.69835975 hartree
xcener: -61.563324521824 hartree
chargesum: -0.0000000
charge: -0.345968 -0.513130 -0.225266 0.070231 0.014392 -0.286170 -0.291875 0.167061 -0.181703 -0.151785 -0.163022 -0.166631 0.496759 -0.154698 0.046163 0.090640 0.090819 0.095063 0.082886 0.108745 0.098765 0.144863 0.149486 0.155910 0.156814 0.181434 0.112809 0.104522 0.112888
qa: -0.3460 -0.5131 -0.2253 0.0702 0.0144 -0.2862 -0.2919 0.1671 -0.1817 -0.1518 -0.1630 -0.1666 0.4968 -0.1547 0.0462 0.0906 0.0908 0.0951 0.0829 0.1087 0.0988 0.1449 0.1495 0.1559 0.1568 0.1814 0.1128 0.1045 0.1129
va: 2.0599 2.0000 3.1946 3.8102 3.6960 3.9161 3.9107 3.7734 3.9176 4.0002 3.9234 3.9121 4.2877 3.8981 1.0197 1.0088 1.0029 1.0033 1.0017 1.0022 1.0028 0.9969 0.9969 0.9923 0.9901 1.0083 0.9883 1.0024 0.9968
dispcorr: -0.011568669 hartree
energy: -633.522344279343
dipole: -0.09731 0.75594 0.65863 -10.80448 10.07850 -0.72598 -1.00262 -0.27580 -1.27843
magnitude: 1.61097 au
magnitude: 4.09476 debye
