program: Orca
programVersion: 5.0.3
elementType: O O N C C C C C C C C C C C H H H H H H H H H H H H H H H
charge: 0
multiplicity: 1
keywords: wb97x-d3
keywords: def2-TZVPP
keywords: def2/J RIJCOSX
keywords: DEFGRID2
keywords: scfconv7
keywords: smallprint printgap noloewdin
keywords: NOSOSCF
formula: C11H15NO2
InChI: InChI=1/C11H15NO2/c1-8(2)9-6-4-5-7-10(9)14-11(13)12-3/h4-8,12H,1-3H3
29 atoms
O  0.864351 0.15632 0.738495
O  1.718459 1.221618 -1.069099
N  3.04857 0.130644 0.426302
C  -0.830926 -1.894348 -0.220045
C  -1.296119 -0.464141 -0.049913
C  -1.642451 -2.675635 -1.248352
C  -0.836594 -2.619094 1.1287
C  -0.4239 0.520992 0.406692
C  -2.611005 -0.077272 -0.295673
C  -0.826326 1.832013 0.594125
C  -3.032937 1.229778 -0.110693
C  -2.138325 2.189023 0.334881
C  1.874405 0.569545 -0.074197
C  4.311057 0.37753 -0.217661
H  0.200464 -1.872414 -0.582945
H  -1.690303 -2.155997 -2.205656
H  -2.66437 -2.860958 -0.912747
H  -1.184613 -3.650073 -1.420999
H  -0.213026 -2.110419 1.862916
H  -0.464789 -3.639864 1.022462
H  -1.849112 -2.673035 1.532773
H  -3.324258 -0.809118 -0.65072
H  -0.115293 2.568449 0.944403
H  -4.061009 1.496859 -0.316339
H  -2.45641 3.212999 0.477713
H  3.028372 -0.430492 1.259683
H  4.735576 -0.533196 -0.644504
H  5.029593 0.796406 0.487432
H  4.167463 1.093485 -1.021788
totalener: -633.49338376 hartree
nucrepener: 905.67141293 hartree
electener: -1539.16479669 hartree
oneelecener: -2657.13594631 hartree
twoeener: 1117.97114962 hartree
kineticenergy: 630.72077444 hartree
xcener: -61.563818641379 hartree
chargesum: 0.0000000
charge: -0.348465 -0.383605 -0.231581 0.043152 0.029613 -0.275813 -0.262461 0.188596 -0.161743 -0.097817 -0.129015 -0.134675 0.422387 -0.148373 0.039875 0.111735 0.071695 0.089394 0.085877 0.083172 0.085396 0.115415 0.110325 0.121537 0.122266 0.141809 0.099607 0.099330 0.112366
qa: -0.3485 -0.3836 -0.2316 0.0432 0.0296 -0.2758 -0.2625 0.1886 -0.1617 -0.0978 -0.1290 -0.1347 0.4224 -0.1484 0.0399 0.1117 0.0717 0.0894 0.0859 0.0832 0.0854 0.1154 0.1103 0.1215 0.1223 0.1418 0.0996 0.0993 0.1124
va: 2.0501 2.1395 3.1510 3.8427 3.7321 3.9201 3.9185 3.8958 3.9713 4.0391 3.9915 3.9757 4.3515 3.8846 1.0200 1.0032 1.0036 1.0061 1.0122 1.0052 1.0068 1.0047 1.0067 1.0023 1.0005 1.0318 0.9897 0.9927 1.0209
dispcorr: -0.011433897 hartree
energy: -633.504817657588
dipole: -0.28883 0.84657 0.55774 -10.83589 10.20074 -0.63516 -0.41518 1.09118 0.67600
magnitude: 1.08234 au
magnitude: 2.75110 debye
