program: Orca
programVersion: 5.0.4
elementType: S P O O O O N C C C C C C C C C C C C C C C H H H H H H H H H H H H H H H H H H H H H H H H
charge: 0
multiplicity: 1
keywords: wb97x-d3
keywords: def2-TZVPP
keywords: def2/J RIJCOSX
keywords: DEFGRID2
keywords: scfconv7
keywords: smallprint printgap noloewdin
keywords: NOSOSCF
formula: C15H24NO4PS
InChI: InChI=1/C15H24NO4PS/c1-6-18-21(22,16-11(2)3)20-14-10-8-7-9-13(14)15(17)19-12(4)5/h7-12,16H,6H2,1-5H3
46 atoms
S  2.648905 1.352606 0.813844
P  1.325862 0.069889 0.253014
O  -0.088768 0.126542 1.090666
O  0.765466 0.232319 -1.238331
O  -1.820953 -1.243221 -0.418839
O  -2.837841 0.006606 -1.9643
N  1.765865 -1.504588 0.388506
C  2.748506 -2.003596 1.356605
C  2.215037 -1.997052 2.780813
C  3.17295 -3.396175 0.924638
C  -0.966737 1.163161 0.906364
C  -2.005262 1.070723 -0.024002
C  1.266669 1.172059 -2.207504
C  -1.989953 -2.462428 -1.185884
C  -0.788895 2.31493 1.658612
C  -2.854369 2.167417 -0.176171
C  -2.25469 -0.10085 -0.907557
C  -1.651916 3.386442 1.498769
C  -2.687811 3.314303 0.578109
C  -1.84158 -3.592275 -0.191428
C  -0.969299 -2.551302 -2.303319
C  0.35019 2.36402 -2.319711
H  3.613781 -1.341455 1.299346
H  1.036558 -2.176336 0.166847
H  1.309936 -2.60212 2.861467
H  1.97953 -0.985136 3.113189
H  2.954824 -2.405477 3.470393
H  2.325725 -4.086093 0.937063
H  3.592195 -3.391595 -0.081463
H  3.928878 -3.78916 1.603869
H  2.277855 1.481201 -1.93897
H  1.322236 0.627179 -3.149084
H  -2.999647 -2.472699 -1.602247
H  0.025804 2.363484 2.368469
H  -3.661471 2.116068 -0.894243
H  -1.508798 4.279862 2.091589
H  -3.365206 4.147163 0.449426
H  -0.845072 -3.603167 0.254579
H  -2.580049 -3.525619 0.607741
H  -1.988973 -4.544134 -0.70066
H  0.047748 -2.599616 -1.91249
H  -1.034045 -1.719181 -3.003115
H  -1.148108 -3.466016 -2.868912
H  0.72908 3.032845 -3.09334
H  0.30476 2.924769 -1.38501
H  -0.660903 2.069225 -2.600569
elementType: S P O N C H
totalener: -1681.49841849 hartree
nucrepener: 2419.20929771 hartree
electener: -4100.70771620 hartree
oneelecener: -7119.69639951 hartree
twoeener: 3018.98868331 hartree
cpcmener: -0.03192714 hartree
kineticenergy: 1675.85144240 hartree
xcener: -127.029852022577 hartree
chargesum: 0.0000000
charge: -0.460598 0.659332 -0.366266 -0.354083 -0.280337 -0.493330 -0.275353 0.103638 -0.263612 -0.267431 0.188193 -0.012632 0.037205 0.148742 -0.166024 -0.162610 0.519353 -0.130566 -0.162856 -0.257460 -0.282680 -0.236799 0.068129 0.173736 0.088393 0.078634 0.093905 0.089158 0.093846 0.092347 0.091417 0.107661 0.080930 0.140135 0.141180 0.164396 0.162252 0.085582 0.100767 0.096883 0.084617 0.099602 0.115278 0.110769 0.073209 0.083348
qa: -0.4606 0.6593 -0.3663 -0.3541 -0.2803 -0.4933 -0.2754 0.1036 -0.2636 -0.2674 0.1882 -0.0126 0.0372 0.1487 -0.1660 -0.1626 0.5194 -0.1306 -0.1629 -0.2575 -0.2827 -0.2368 0.0681 0.1737 0.0884 0.0786 0.0939 0.0892 0.0938 0.0923 0.0914 0.1077 0.0809 0.1401 0.1412 0.1644 0.1623 0.0856 0.1008 0.0969 0.0846 0.0996 0.1153 0.1108 0.0732 0.0833
va: 1.9958 5.4497 2.0618 2.0797 2.1500 1.9871 3.1362 3.8735 3.9056 3.9212 3.8457 3.5421 3.8310 3.7882 3.9724 3.9603 4.0504 3.9257 3.9143 3.9500 3.8954 3.9126 1.0283 1.0257 1.0055 1.0219 1.0088 1.0021 1.0111 1.0046 1.0221 0.9938 1.0181 1.0161 1.0244 0.9869 0.9900 0.9999 1.0076 1.0052 1.0117 1.0159 1.0078 1.0114 1.0105 1.0132
dispcorr: -0.028446872 hartree
energy: -1681.526865364374
dipole: 4.40143 -4.50100 -0.09957 -18.62258 17.24846 -1.37412 -4.01241 4.03903 0.02662
magnitude: 1.37798 au
magnitude: 3.50255 debye
