program: Orca
programVersion: 5.0.4
elementType: S P O O O O N C C C C C C C C C C C C C C C H H H H H H H H H H H H H H H H H H H H H H H H
charge: 0
multiplicity: 1
keywords: wb97x-d3
keywords: def2-TZVPP
keywords: def2/J RIJCOSX
keywords: DEFGRID2
keywords: scfconv7
keywords: smallprint printgap noloewdin
keywords: NOSOSCF
formula: C15H24NO4PS
InChI: InChI=1/C15H24NO4PS/c1-6-18-21(22,16-11(2)3)20-14-10-8-7-9-13(14)15(17)19-12(4)5/h7-12,16H,6H2,1-5H3
46 atoms
S  2.285982 2.14578 0.766558
P  1.374133 0.687164 -0.105236
O  0.00305 1.098812 -0.914967
O  2.071566 0.103866 -1.423278
O  -1.157054 -1.309122 -1.170473
O  -3.380073 -1.214836 -1.334028
N  1.033631 -0.57513 0.879302
C  1.031193 -0.575681 2.342448
C  -0.34569 -0.251892 2.901311
C  1.533484 -1.92493 2.830251
C  -1.146829 1.426599 -0.246016
C  -2.257037 0.577001 -0.278922
C  3.502592 0.000186 -1.536863
C  -1.093597 -2.638676 -1.750138
C  -1.21651 2.65396 0.399776
C  -3.421507 0.988325 0.373778
C  -2.325115 -0.731385 -0.9871
C  -2.375622 3.028985 1.057581
C  -3.480778 2.190091 1.054041
C  -1.409015 -3.672538 -0.687845
C  0.305729 -2.794266 -2.303106
C  4.102723 -1.042425 -0.625709
H  1.734431 0.194742 2.661304
H  0.529694 -1.349221 0.46101
H  -1.085802 -0.980649 2.564261
H  -0.677211 0.739206 2.588219
H  -0.331285 -0.270601 3.99193
H  0.876494 -2.732973 2.499771
H  2.537902 -2.130075 2.458825
H  1.564401 -1.948037 3.919642
H  3.677142 -0.25573 -2.580497
H  3.948589 0.979821 -1.353281
H  -1.815499 -2.699905 -2.56681
H  -0.361441 3.315357 0.378406
H  -4.291268 0.3462 0.35801
H  -2.41384 3.983128 1.565937
H  -4.389119 2.476998 1.565433
H  -2.419732 -3.571749 -0.294456
H  -1.322154 -4.670609 -1.117666
H  -0.704233 -3.603385 0.143352
H  0.384259 -3.760003 -2.801678
H  1.057283 -2.767676 -1.512089
H  0.538864 -2.022989 -3.03692
H  5.163508 -1.138867 -0.859353
H  3.638837 -2.018508 -0.769785
H  4.022338 -0.768709 0.426398
elementType: S P O N C H
totalener: -1681.49747963 hartree
nucrepener: 2415.34913135 hartree
electener: -4096.84661098 hartree
oneelecener: -7111.35129049 hartree
twoeener: 3014.50467951 hartree
cpcmener: -0.03316337 hartree
kineticenergy: 1675.85409159 hartree
xcener: -127.033319511867 hartree
chargesum: -0.0000000
charge: -0.469900 0.651766 -0.357522 -0.368474 -0.281229 -0.491698 -0.232103 0.120272 -0.278965 -0.269289 0.137501 -0.019322 0.028176 0.166480 -0.148628 -0.152808 0.523990 -0.132819 -0.163951 -0.272425 -0.283697 -0.251447 0.062829 0.169966 0.088631 0.080871 0.102797 0.089295 0.092396 0.095275 0.111059 0.097447 0.086960 0.145245 0.142228 0.164043 0.162935 0.096224 0.106299 0.090767 0.110403 0.076474 0.101188 0.105861 0.091336 0.075561
qa: -0.4699 0.6518 -0.3575 -0.3685 -0.2812 -0.4917 -0.2321 0.1203 -0.2790 -0.2693 0.1375 -0.0193 0.0282 0.1665 -0.1486 -0.1528 0.5240 -0.1328 -0.1640 -0.2724 -0.2837 -0.2514 0.0628 0.1700 0.0886 0.0809 0.1028 0.0893 0.0924 0.0953 0.1111 0.0974 0.0870 0.1452 0.1422 0.1640 0.1629 0.0962 0.1063 0.0908 0.1104 0.0765 0.1012 0.1059 0.0913 0.0756
va: 1.9868 5.4466 2.0883 2.0673 2.1412 2.0041 3.0847 3.8324 3.9366 3.9268 3.9480 3.5790 3.8337 3.7615 3.9154 3.9770 4.0775 3.9279 3.9178 3.9284 3.9515 3.9133 1.0354 1.0368 1.0050 1.0111 1.0118 1.0011 1.0065 1.0060 0.9915 1.0153 1.0204 1.0190 1.0199 0.9880 0.9904 1.0166 1.0060 0.9968 1.0072 1.0033 1.0091 1.0103 1.0003 1.0132
dispcorr: -0.028899872 hartree
energy: -1681.526379503632
dipole: 8.07662 -7.43261 0.64400 -24.00448 22.09498 -1.90950 8.44228 -7.62956 0.81272
magnitude: 2.17289 au
magnitude: 5.52305 debye
