program: Orca
programVersion: 5.0.4
elementType: S P O O O O N C C C C C C C C C C C C C C C H H H H H H H H H H H H H H H H H H H H H H H H
charge: 0
multiplicity: 1
keywords: wb97x-d3
keywords: def2-TZVPP
keywords: def2/J RIJCOSX
keywords: DEFGRID2
keywords: scfconv7
keywords: smallprint printgap noloewdin
keywords: NOSOSCF
formula: C15H24NO4PS
InChI: InChI=1/C15H24NO4PS/c1-6-18-21(22,16-11(2)3)20-14-10-8-7-9-13(14)15(17)19-12(4)5/h7-12,16H,6H2,1-5H3
46 atoms
S  2.511039 2.072283 0.172403
P  1.349645 0.58695 -0.237057
O  -0.082589 0.988148 -0.93182
O  1.791397 -0.326142 -1.479783
O  -1.284406 -1.437825 -0.747116
O  -3.469948 -1.173492 -1.132381
N  1.02168 -0.391183 1.031838
C  1.323867 -0.156591 2.442387
C  0.113956 0.395559 3.180214
C  1.822462 -1.452108 3.06254
C  -1.153314 1.397318 -0.181377
C  -2.282752 0.58172 -0.08117
C  3.171838 -0.639818 -1.733026
C  -1.235557 -2.741311 -1.383327
C  -1.137077 2.657445 0.398853
C  -3.39276 1.064639 0.612372
C  -2.411853 -0.757143 -0.718778
C  -2.239702 3.104432 1.108305
C  -3.3693 2.306254 1.221648
C  -0.11017 -3.500834 -0.71659
C  -1.019702 -2.564988 -2.87159
C  3.785998 -1.539123 -0.687568
H  2.127775 0.579634 2.476626
H  0.370992 -1.149421 0.861091
H  0.341313 0.543922 4.236632
H  -0.73135 -0.292352 3.111704
H  -0.195659 1.355709 2.766163
H  1.052077 -2.225997 3.030635
H  2.701828 -1.826145 2.537215
H  2.092809 -1.295822 4.106932
H  3.168534 -1.129097 -2.705562
H  3.73929 0.288313 -1.828033
H  -2.178433 -3.258193 -1.197076
H  -0.265386 3.287818 0.284772
H  -4.27928 0.449425 0.688659
H  -2.215765 4.084525 1.565401
H  -4.233251 2.655106 1.770202
H  -0.265669 -3.586944 0.359508
H  -0.06822 -4.510027 -1.125607
H  0.857664 -3.029912 -0.893718
H  -1.838425 -2.023168 -3.344455
H  -0.955746 -3.544368 -3.346071
H  -0.088596 -2.033203 -3.07228
H  3.887925 -1.04187 0.277168
H  4.786066 -1.822903 -1.016566
H  3.207391 -2.452873 -0.550666
elementType: S P O N C H
totalener: -1681.49776995 hartree
nucrepener: 2417.16339053 hartree
electener: -4098.66116048 hartree
oneelecener: -7115.00991176 hartree
twoeener: 3016.34875128 hartree
cpcmener: -0.03195497 hartree
kineticenergy: 1675.85970167 hartree
xcener: -127.034248061830 hartree
chargesum: 0.0000000
charge: -0.466746 0.634750 -0.360974 -0.361659 -0.283823 -0.486107 -0.234795 0.118668 -0.285099 -0.275196 0.122671 0.003675 0.027452 0.142923 -0.150929 -0.165528 0.527426 -0.133351 -0.163126 -0.261006 -0.260867 -0.258356 0.065279 0.186288 0.101407 0.091270 0.088633 0.090818 0.092744 0.095090 0.109417 0.100503 0.078859 0.147521 0.143850 0.164252 0.163039 0.102717 0.111624 0.065644 0.098272 0.103846 0.087955 0.075383 0.108265 0.097317
qa: -0.4667 0.6348 -0.3610 -0.3617 -0.2838 -0.4861 -0.2348 0.1187 -0.2851 -0.2752 0.1227 0.0037 0.0275 0.1429 -0.1509 -0.1655 0.5274 -0.1334 -0.1631 -0.2610 -0.2609 -0.2584 0.0653 0.1863 0.1014 0.0913 0.0886 0.0908 0.0927 0.0951 0.1094 0.1005 0.0789 0.1475 0.1439 0.1643 0.1630 0.1027 0.1116 0.0656 0.0983 0.1038 0.0880 0.0754 0.1083 0.0973
va: 1.9917 5.4601 2.0839 2.0651 2.1382 2.0105 3.0784 3.8224 3.9308 3.9265 3.9400 3.5706 3.8269 3.8084 3.9024 3.9876 4.0676 3.9212 3.9151 3.9124 3.9201 3.9136 1.0355 1.0219 1.0116 1.0052 1.0101 1.0018 1.0049 1.0065 0.9921 1.0160 1.0230 1.0175 1.0171 0.9875 0.9898 1.0064 1.0095 1.0186 1.0133 1.0052 1.0107 1.0125 1.0107 0.9943
dispcorr: -0.029038270 hartree
energy: -1681.526808218799
dipole: 8.93716 -8.39892 0.53824 -21.46293 19.60803 -1.85489 8.77865 -7.49837 1.28027
magnitude: 2.31720 au
magnitude: 5.88986 debye
