program: Orca
programVersion: 5.0.4
elementType: S P O O O O N C C C C C C C C C C C C C C C H H H H H H H H H H H H H H H H H H H H H H H H
charge: 0
multiplicity: 1
keywords: wb97x-d3
keywords: def2-TZVPP
keywords: def2/J RIJCOSX
keywords: DEFGRID2
keywords: scfconv7
keywords: smallprint printgap noloewdin
keywords: NOSOSCF
formula: C15H24NO4PS
InChI: InChI=1/C15H24NO4PS/c1-6-18-21(22,16-11(2)3)20-14-10-8-7-9-13(14)15(17)19-12(4)5/h7-12,16H,6H2,1-5H3
46 atoms
S  2.84844 1.604863 -0.339343
P  1.508497 0.348281 0.240842
O  0.449282 0.895686 1.358913
O  0.518086 -0.159677 -0.921733
O  -2.6618 -1.079791 -0.276273
O  -1.251064 -1.300266 1.443609
N  2.075596 -0.947219 1.075884
C  3.284861 -1.676087 0.68361
C  3.838726 -2.397426 1.900993
C  3.026749 -2.633925 -0.471321
C  -0.689894 1.572166 1.021406
C  -1.852547 0.877891 0.680201
C  0.533627 0.304948 -2.282677
C  -2.81388 -2.513463 -0.422686
C  -0.662109 2.957302 1.023257
C  -2.989844 1.609478 0.343365
C  -1.870831 -0.609428 0.670857
C  -1.80769 3.666793 0.698067
C  -2.972772 2.994245 0.358472
C  -1.671164 -3.071288 -1.247958
C  -4.161125 -2.729423 -1.07539
C  -0.317056 1.534279 -2.482007
H  4.013007 -0.927344 0.36496
H  1.361495 -1.532961 1.497405
H  4.763559 -2.916453 1.647779
H  3.133258 -3.142571 2.276291
H  4.055885 -1.698825 2.70945
H  3.935414 -3.177334 -0.734646
H  2.263314 -3.368705 -0.206094
H  2.69125 -2.105251 -1.364978
H  1.562233 0.491342 -2.5961
H  0.15232 -0.529925 -2.870265
H  -2.813912 -2.97029 0.569344
H  0.253131 3.473109 1.283472
H  -3.90131 1.093847 0.072142
H  -1.784968 4.748633 0.705304
H  -3.867011 3.546523 0.102768
H  -1.803809 -4.147175 -1.367065
H  -1.64934 -2.625719 -2.244102
H  -0.701854 -2.914318 -0.775492
H  -4.969389 -2.318347 -0.469336
H  -4.343383 -3.798314 -1.186953
H  -4.206329 -2.277378 -2.06769
H  -1.35192 1.364378 -2.185147
H  -0.313485 1.79567 -3.541567
H  0.072343 2.390119 -1.930357
elementType: S P O N C H
totalener: -1681.50997147 hartree
nucrepener: 2398.58869905 hartree
electener: -4080.09867052 hartree
oneelecener: -7078.71892513 hartree
twoeener: 2998.62025462 hartree
cpcmener: -0.02526387 hartree
kineticenergy: 1675.84456589 hartree
xcener: -127.027238271765 hartree
chargesum: 0.0000000
charge: -0.458081 0.626780 -0.355533 -0.338032 -0.279592 -0.453688 -0.242137 0.101443 -0.264123 -0.280628 0.195413 -0.002559 0.031650 0.167881 -0.178429 -0.214984 0.499225 -0.122752 -0.144334 -0.266576 -0.261685 -0.243173 0.061617 0.162416 0.088485 0.088976 0.092883 0.097876 0.087133 0.087815 0.097696 0.108386 0.067986 0.141935 0.144195 0.160853 0.159206 0.107269 0.088616 0.082994 0.097703 0.094291 0.090208 0.088346 0.109238 0.077790
qa: -0.4581 0.6268 -0.3555 -0.3380 -0.2796 -0.4537 -0.2421 0.1014 -0.2641 -0.2806 0.1954 -0.0026 0.0316 0.1679 -0.1784 -0.2150 0.4992 -0.1228 -0.1443 -0.2666 -0.2617 -0.2432 0.0616 0.1624 0.0885 0.0890 0.0929 0.0979 0.0871 0.0878 0.0977 0.1084 0.0680 0.1419 0.1442 0.1609 0.1592 0.1073 0.0886 0.0830 0.0977 0.0943 0.0902 0.0883 0.1092 0.0778
va: 2.0064 5.4999 2.1108 2.0200 2.1286 2.0411 3.1386 3.8657 3.9219 3.9130 3.8583 3.4832 3.8013 3.8052 3.9710 4.0050 4.0946 3.9056 3.8996 3.9080 3.9401 3.9208 1.0332 1.0349 1.0052 1.0028 1.0114 1.0098 1.0046 1.0103 1.0215 0.9884 1.0236 1.0125 1.0180 0.9874 0.9904 1.0098 1.0060 1.0196 1.0066 1.0060 1.0063 1.0061 1.0119 1.0147
dispcorr: -0.027795138 hartree
energy: -1681.537766603835
dipole: -3.62602 1.79904 -1.82698 -20.57603 19.43779 -1.13824 -12.83435 11.38651 -1.44784
magnitude: 2.59417 au
magnitude: 6.59386 debye
