program: Gaussian 09
title: 000065807
version: EM64L-G09RevD.01
frameworkgroup: C1[X(C12H18N2O7)]
method: RPBEPBE
basis: SDD
operation: Freq
keyword: #p
keyword: freq=noraman
keyword: PBEPBE/SDD
title: #p freq=noraman PBEPBE/SDD
converged: YES YES NO NO
title: Mulliken charges:
elementType: O O O O O O O N N C C C C C C C C C C C C H H H H H H H H H H H H H H H H H H
charge: -0.264225 -0.433757 -0.550173 -0.439954 -0.279977 -0.256173 -0.488774 -0.357323 -0.359243 0.181567 -0.233451 0.341448 -0.061220 0.178814 0.080347 0.591779 -0.330990 -0.568371 -0.427854 -0.722266 -0.718193 0.236956 0.421639 0.350749 0.224733 0.226464 0.222114 0.248970 0.207845 0.270470 0.207383 0.231878 0.277111 0.377219 0.385883 0.386306 0.256922 0.221662 0.363685
chargesum: 0.00000
title: Mulliken charges with hydrogens summed into heavy atoms:
elementType: O O O O O O O N N C C C C C C C C C C C C
charge: -0.264225 -0.056539 -0.164289 -0.053649 -0.279977 -0.256173 -0.125089 0.064317 -0.008494 0.181567 0.003506 0.341448 -0.061220 0.178814 0.080347 0.591779 0.120207 -0.097287 0.050461 -0.005893 -0.239609
polarizability: 2.02026548e+02 1.20309713e+01 1.48357541e+02 -1.44537197e+01 -1.45224536e+00 1.42824199e+02
1716.lowfreq: -7.8699 -5.6225 -0.0010 -0.0005 -0.0004 5.7378 30.3622 57.2980 78.3736
frequency: 30.2432 57.2748 78.3604 87.6200 107.1630 116.4298 126.5183 154.4669 188.9896 211.4216 218.9238 244.0557 247.9051 261.8659 278.6655 280.3301 298.6655 316.4916 328.9474 339.9564 360.3850 368.4746 380.1825 393.8497 417.1535 438.4906 446.5126 464.5411 475.8855 493.2462 501.9279 523.8890 546.4255 585.2002 594.0102 600.3678 632.8684 653.6383 662.3680 693.0132 705.5395 719.5868 755.3376 766.6109 819.2309 829.1801 868.2772 894.2143 905.7940 921.0742 934.6780 957.7199 963.7793 971.8504 973.7808 989.8475 1016.7751 1033.2381 1049.8277 1057.5046 1080.8398 1101.6586 1111.1416 1123.1229 1130.6542 1173.3238 1183.0638 1194.4431 1240.2890 1250.9894 1271.5300 1287.8518 1301.9144 1323.2966 1324.3697 1334.7096 1346.2686 1357.4037 1364.9806 1372.2455 1386.7419 1389.8285 1397.9995 1415.3668 1446.9867 1463.8055 1465.3832 1466.0558 1477.5632 1487.9929 1617.7542 1641.2596 1659.0352 2987.3805 2989.2892 2993.9178 2996.0154 3000.6169 3046.8362 3074.8827 3076.7973 3078.9749 3091.1028 3106.5016 3140.6006 3220.8519 3360.6664 3470.2172 3480.5914 3515.5238 3614.3287
redmass: 4.5468 5.1246 3.9550 4.5299 6.1580 7.2153 5.6898 4.3652 5.2375 5.5215 3.5515 1.2616 1.1219 5.0025 4.3960 4.0523 3.0160 5.3076 4.1407 4.9857 5.1065 3.9630 2.4676 4.5411 4.3671 4.1643 4.7223 3.0778 3.8437 2.4919 1.7773 1.8545 1.4633 1.7064 4.9938 1.7581 2.2905 3.1762 3.3071 3.2008 1.7398 4.4184 4.0811 2.7623 2.8808 5.0834 2.6055 2.3453 2.3080 2.4518 1.8356 3.5928 1.6772 2.4391 1.6568 2.0307 2.5192 4.6786 3.8611 4.1752 3.4326 1.8942 3.9975 1.6815 1.5084 1.7216 1.2752 1.9344 1.7117 1.6892 1.4810 1.4970 1.5224 1.5923 1.5319 1.3613 2.7620 1.5406 1.7203 1.4041 1.8699 1.5973 1.3618 1.1627 1.1022 1.0684 1.0852 1.0661 1.0985 1.3796 6.8829 5.8671 5.8823 1.0624 1.0740 1.0609 1.0614 1.0454 1.0993 1.0986 1.1038 1.0894 1.0976 1.0632 1.0989 1.1130 1.0645 1.0653 1.0646 1.0769 1.0672
irintensity: 1.1033 0.6176 1.9333 2.4047 3.8506 0.7511 3.2055 3.4876 11.8341 4.8661 2.0536 3.8597 137.9555 6.4323 7.4084 2.6171 2.8324 28.8629 11.1631 22.2850 9.2937 12.4958 0.8037 1.9133 10.6615 6.1326 13.5885 7.6576 14.4948 5.3952 35.2672 27.0131 146.9587 88.1770 41.2443 123.2533 30.8224 71.4109 27.6427 7.3191 66.1062 33.3705 9.9926 42.3119 1.1037 31.0264 5.6754 3.9801 1.4224 40.3667 27.4066 79.4510 19.9763 61.8026 66.4552 101.3418 24.5827 154.0175 33.9933 75.3835 30.8127 7.1797 72.5919 80.7445 14.6497 29.3098 7.5610 31.4334 13.2494 63.8251 48.6064 65.2122 38.0360 17.6905 15.5464 12.8842 45.6239 44.3277 107.6931 19.7570 56.9209 6.8602 49.9643 11.0597 29.4353 17.1995 9.2682 5.4399 21.6666 110.8682 334.8982 299.1107 100.6546 14.1098 2.5890 20.4682 31.8417 40.8720 21.9235 221.8580 35.1006 572.4620 85.2757 7.2732 5.5874 4.2763 66.4937 64.6472 63.0246 47.8409 14.3749
temp: 298.150 k
press: 1.00000 atm
elementType: 8 8 8 8 8 8 8 7 7 6 6 6 6 6 6 6 6 6 6 6 6 1 1 1 1 1 1 1 1 1 1 1 1 1 1 1 1 1 1
symmnumber: 1
zpe: 800155.4 jmol-1
zpe.correction: 0.304763 hartree
zpe.thermalcorrener: 0.325191 hartree
zpe.thermalcorrenthalpy: 0.326135 hartree
zpe.thermalcorrgfe: 0.257710 hartree
zpe.sumelectzpe: -1102.495994 hartree
zpe.sumelectthermal: -1102.475566 hartree
zpe.sumelectthermalent: -1102.474622 hartree
zpe.sumelectthermalfe: -1102.543047 hartree
dipole: 1.0945 -5.3753 -3.1761
dipole: 6.3388
quadrupole: -117.4292 -115.8830 -134.1759
quadrupole: -5.9366 0.1384 5.8554
quadrupole: 5.0669 6.6130 -11.6799 -5.9366 0.1384 5.8554
hfenergy: -1102.8007571 hartree
pointgroup: C01[X(C12H18N2O7)]
dipole: 0.3691443 2.0514621 1.3691526 debye
polarizability: 202.8446532|-11.1368578|147.75018|13.6263908|-0.6639561|142.6134546 unknown
InChI: InChI=1S/C12H18N2O7/c1-6-3-4-21-12(7(16)10(2,19)5-15)9(18)13-11(6,20)8(17)14-12/h7,13-16,19-20H,1,3-5H2,2H3
charge 0 multiplicity 1
39 atoms
O  0.331461 0.720717 1.448058
O  1.929172 -2.17417 -0.211334
O  2.451328 0.539321 -1.518906
O  -3.463536 -1.059803 -1.146256
O  -0.088593 -2.449253 1.671852
O  -1.65421 0.271549 -2.577934
O  4.047249 2.169056 -0.202762
N  -0.029644 0.080101 -0.908733
N  -1.853185 -1.468614 0.524855
C  0.368626 -0.36315 0.419213
C  1.855421 -0.873176 0.442031
C  2.941901 0.043785 -0.200856
C  -2.418754 -0.436928 -0.372283
C  -0.547658 -1.526009 0.925765
C  -1.304729 0.015714 -1.385775
C  -2.963125 0.769977 0.427824
C  -0.717012 1.757414 1.330835
C  -2.160297 1.271561 1.619124
C  3.220327 1.298812 0.66682
C  4.241943 -0.753251 -0.425607
C  -4.129728 1.346848 0.047217
H  2.099771 -0.964481 1.520976
H  0.780192 0.365911 -1.514023
H  -2.499969 -2.19937 0.838669
H  -0.655135 2.256783 0.344173
H  -0.413381 2.476278 2.110752
H  -2.712949 2.124158 2.056756
H  -2.101088 0.498666 2.410907
H  3.779532 1.013102 1.578797
H  2.276452 1.797272 0.945144
H  4.565766 -1.250593 0.506759
H  5.042603 -0.071674 -0.761005
H  4.065187 -1.531681 -1.180734
H  1.481609 -2.820165 0.400976
H  3.028144 1.319686 -1.742716
H  -3.267949 -0.839134 -2.105636
H  -4.710093 0.943555 -0.786752
H  -4.534099 2.216134 0.578493
H  4.12445 3.070454 0.191816
