program: Orca
programVersion: 5.0.4
elementType: S P O O O O N C C C C C C C C C C C C C C C H H H H H H H H H H H H H H H H H H H H H H H H
charge: 0
multiplicity: 1
keywords: wb97x-d3
keywords: def2-TZVPP
keywords: def2/J RIJCOSX
keywords: DEFGRID2
keywords: scfconv7
keywords: smallprint printgap noloewdin
keywords: NOSOSCF
formula: C15H24NO4PS
InChI: InChI=1/C15H24NO4PS/c1-6-18-21(22,16-11(2)3)20-14-10-8-7-9-13(14)15(17)19-12(4)5/h7-12,16H,6H2,1-5H3
46 atoms
S  2.368083 2.624466 0.42454
P  1.5640 1.049977 -0.350525
O  0.022375 1.248255 -0.881325
O  2.102331 0.616403 -1.794884
O  -2.832534 -1.647688 -1.016182
O  -0.614051 -1.438077 -1.140362
N  1.583568 -0.26776 0.616508
C  1.950846 -0.344351 2.028241
C  0.720181 -0.319991 2.922032
C  2.789815 -1.592321 2.256966
C  -1.024362 1.269044 -0.004525
C  -1.90116 0.182456 0.063452
C  3.491587 0.737356 -2.14524
C  -2.826043 -2.92597 -1.699217
C  -1.250047 2.408761 0.753881
C  -2.996215 0.264723 0.925867
C  -1.689879 -1.040173 -0.757124
C  -2.335527 2.463072 1.612391
C  -3.205439 1.386546 1.707622
C  -4.184994 -3.0576 -2.349894
C  -2.542419 -4.032952 -0.703874
C  4.392431 -0.199873 -1.376782
H  2.56201 0.532539 2.246209
H  1.138764 -1.098995 0.239892
H  0.064649 -1.168362 2.713086
H  0.146841 0.596949 2.777825
H  1.006832 -0.37177 3.97394
H  3.098147 -1.661423 3.300736
H  2.225257 -2.497209 2.019435
H  3.689513 -1.583633 1.640474
H  3.52635 0.513262 -3.210446
H  3.808116 1.774158 -2.011636
H  -2.053204 -2.908604 -2.47035
H  -0.579469 3.252448 0.661654
H  -3.686663 -0.564019 1.000555
H  -2.501444 3.353009 2.205099
H  -4.052725 1.425132 2.378785
H  -4.236074 -3.998921 -2.897237
H  -4.987674 -3.057428 -1.610371
H  -4.368573 -2.251721 -3.061347
H  -1.563586 -3.925699 -0.236111
H  -2.555824 -4.995851 -1.215602
H  -3.300251 -4.060281 0.080851
H  4.057574 -1.235093 -1.452492
H  4.466747 0.069147 -0.322477
H  5.397055 -0.142689 -1.798707
elementType: S P O N C H
totalener: -1681.51057900 hartree
nucrepener: 2345.55244628 hartree
electener: -4027.06302528 hartree
oneelecener: -6972.96418190 hartree
twoeener: 2945.90115662 hartree
cpcmener: -0.02495065 hartree
kineticenergy: 1675.84741861 hartree
xcener: -127.030098875710 hartree
chargesum: -0.0000000
charge: -0.473499 0.658194 -0.349865 -0.358562 -0.289510 -0.474656 -0.246836 0.111515 -0.274579 -0.266553 0.146935 -0.010580 0.032547 0.158378 -0.150239 -0.187822 0.533399 -0.129437 -0.156339 -0.251019 -0.267162 -0.250858 0.061105 0.182400 0.086921 0.084085 0.098996 0.091729 0.090305 0.091992 0.108775 0.089339 0.071773 0.142265 0.145118 0.160771 0.159019 0.091098 0.089125 0.098207 0.096875 0.099483 0.090824 0.089965 0.075225 0.101150
qa: -0.4735 0.6582 -0.3499 -0.3586 -0.2895 -0.4747 -0.2468 0.1115 -0.2746 -0.2666 0.1469 -0.0106 0.0325 0.1584 -0.1502 -0.1878 0.5334 -0.1294 -0.1563 -0.2510 -0.2672 -0.2509 0.0611 0.1824 0.0869 0.0841 0.0990 0.0917 0.0903 0.0920 0.1088 0.0893 0.0718 0.1423 0.1451 0.1608 0.1590 0.0911 0.0891 0.0982 0.0969 0.0995 0.0908 0.0900 0.0752 0.1012
va: 1.9733 5.4683 2.1073 2.0876 2.1522 2.0011 3.0845 3.8361 3.9281 3.9309 3.9420 3.5821 3.8564 3.8045 3.9289 4.0030 4.0409 3.9309 3.9096 3.9365 3.9194 3.9003 1.0370 1.0294 1.0069 1.0105 1.0120 1.0068 1.0025 1.0056 0.9907 1.0132 1.0226 1.0193 1.0183 0.9888 0.9914 1.0056 1.0058 1.0080 1.0138 1.0055 1.0061 1.0059 1.0136 1.0102
dispcorr: -0.025573775 hartree
energy: -1681.536152770939
dipole: -0.20841 -1.02047 -1.22888 -24.27640 22.15562 -2.12078 6.26412 -5.56682 0.69730
magnitude: 2.54835 au
magnitude: 6.47738 debye
