program: Orca
programVersion: 5.0.4
elementType: S P O O N N N N C C C C C C C C C C C H H H H H H H H H H H H H H H H H H H H H
charge: 0
multiplicity: 1
keywords: wb97x-d3
keywords: def2-TZVPP
keywords: def2/J RIJCOSX
keywords: DEFGRID2
keywords: scfconv7
keywords: smallprint printgap noloewdin
keywords: NOSOSCF
formula: C11H21N4O2PS
InChI: InChI=1/C11H21N4O2PS/c1-4-9-19-18(16,17-6-3)15-8-7-14(5-2)11(15)13-10-12/h4-9H2,1-3H3
40 atoms
S  2.215126 1.090352 0.399572
P  1.258777 -0.239539 -0.864986
O  0.916978 0.767606 -2.047746
O  2.040112 -1.460724 -1.196226
N  -0.244273 -0.73578 -0.252383
N  -2.119308 -0.662757 0.91471
N  -0.970073 1.367621 0.317971
N  -2.304328 3.184673 1.303826
C  -0.585298 -2.143933 -0.028094
C  -2.032505 -2.035783 0.430296
C  -1.157882 0.079624 0.355287
C  -3.39419 -0.161531 1.401897
C  -4.374535 0.195487 0.29956
C  3.50698 0.05138 1.181016
C  -0.111067 0.506338 -3.030532
C  3.120783 -0.470239 2.552278
C  0.171151 -0.710396 -3.877068
C  1.936625 -1.418972 2.551121
C  -1.729947 2.270478 0.866675
H  -0.486503 -2.725204 -0.940518
H  0.052336 -2.577542 0.741767
H  -2.270776 -2.741131 1.223293
H  -2.731022 -2.19043 -0.395221
H  -3.808394 -0.9471 2.03314
H  -3.218759 0.686451 2.060431
H  -3.995856 0.990464 -0.343583
H  -4.607933 -0.666653 -0.325184
H  -5.306649 0.543228 0.74464
H  4.370781 0.712613 1.25196
H  3.77605 -0.753854 0.499169
H  -0.133815 1.405242 -3.643442
H  -1.077834 0.421829 -2.531459
H  2.927612 0.370113 3.222605
H  4.001417 -0.982822 2.949188
H  1.786271 -1.852522 3.539836
H  1.011213 -0.906753 2.282767
H  2.085901 -2.241537 1.849313
H  0.102407 -1.638713 -3.309782
H  -0.573076 -0.758592 -4.672466
H  1.154608 -0.655302 -4.343277
elementType: S P O N C H
totalener: -1541.03405789 hartree
nucrepener: 1956.85478181 hartree
electener: -3497.88883970 hartree
oneelecener: -6003.59097531 hartree
twoeener: 2505.70213561 hartree
cpcmener: -0.05388166 hartree
kineticenergy: 1535.95126485 hartree
xcener: -113.722877442472 hartree
chargesum: -0.0000000
charge: -0.172463 0.770019 -0.354300 -0.642607 -0.103598 -0.121710 -0.449433 -0.268539 -0.116512 -0.013052 0.344895 -0.060853 -0.247250 -0.099901 0.031833 -0.076614 -0.254171 -0.273077 0.011291 0.129675 0.134722 0.112168 0.109205 0.102176 0.106191 0.084289 0.093292 0.102614 0.128774 0.112220 0.113712 0.093160 0.067942 0.074791 0.101973 0.066636 0.083464 0.082961 0.100187 0.095891
qa: -0.1725 0.7700 -0.3543 -0.6426 -0.1036 -0.1217 -0.4494 -0.2685 -0.1165 -0.0131 0.3449 -0.0609 -0.2473 -0.0999 0.0318 -0.0766 -0.2542 -0.2731 0.0113 0.1297 0.1347 0.1122 0.1092 0.1022 0.1062 0.0843 0.0933 0.1026 0.1288 0.1122 0.1137 0.0932 0.0679 0.0748 0.1020 0.0666 0.0835 0.0830 0.1002 0.0959
va: 2.3088 5.4041 2.1157 1.9414 3.0893 3.2682 2.8829 3.1286 3.9394 3.8973 4.0986 3.8847 3.9087 3.8621 3.8878 3.8652 3.9321 3.9332 4.4143 1.0048 0.9964 1.0051 0.9995 0.9993 1.0074 1.0079 1.0045 1.0069 1.0063 1.0335 0.9867 0.9965 1.0124 1.0095 1.0105 1.0065 1.0056 1.0066 1.0078 1.0055
dispcorr: -0.022666274 hartree
energy: -1541.056724158788
dipole: -8.64791 7.37412 -1.27379 -15.16747 11.17554 -3.99192 2.47240 -2.59051 -0.11811
magnitude: 4.19189 au
magnitude: 10.65494 debye
