program: Orca
programVersion: 5.0.4
elementType: S P O O N N N N C C C C C C C C C C C H H H H H H H H H H H H H H H H H H H H H
charge: 0
multiplicity: 1
keywords: wb97x-d3
keywords: def2-TZVPP
keywords: def2/J RIJCOSX
keywords: DEFGRID2
keywords: scfconv7
keywords: smallprint printgap noloewdin
keywords: NOSOSCF
formula: C11H21N4O2PS
InChI: InChI=1/C11H21N4O2PS/c1-4-9-19-18(16,17-6-3)15-8-7-14(5-2)11(15)13-10-12/h4-9H2,1-3H3
40 atoms
S  2.229293 1.034153 0.453132
P  1.280237 -0.242091 -0.871985
O  1.012729 0.801288 -2.041581
O  2.036833 -1.475456 -1.213869
N  -0.236569 -0.709259 -0.281141
N  -2.091807 -0.593644 0.906396
N  -1.029893 1.412964 0.124958
N  -2.466433 3.244465 0.92487
C  -0.634125 -2.112398 -0.131265
C  -1.828007 -2.021875 0.819721
C  -1.16867 0.124541 0.276635
C  -3.284864 -0.107789 1.575342
C  -4.455363 0.103031 0.633444
C  3.404247 -0.084576 1.309093
C  0.006968 0.607925 -3.06148
C  2.911522 -0.583779 2.654323
C  0.258861 -0.605125 -3.922653
C  1.69225 -1.484596 2.582456
C  -1.835756 2.324385 0.588076
H  -0.912795 -2.527418 -1.098942
H  0.169064 -2.712739 0.286278
H  -1.602908 -2.420761 1.809955
H  -2.698086 -2.548837 0.429821
H  -3.537452 -0.854036 2.328308
H  -3.052728 0.802376 2.125686
H  -4.718912 -0.821227 0.118707
H  -5.32649 0.431221 1.200283
H  -4.237482 0.862328 -0.117684
H  4.30069 0.523099 1.433948
H  3.664574 -0.904185 0.640921
H  0.047666 1.517976 -3.656753
H  -0.978142 0.562227 -2.594755
H  2.712572 0.266184 3.310658
H  3.744522 -1.130076 3.105619
H  1.85357 -2.319235 1.897967
H  1.461662 -1.901743 3.562773
H  0.808846 -0.937967 2.251165
H  0.118616 -1.53929 -3.37861
H  -0.453875 -0.598225 -4.747695
H  1.261857 -0.593071 -4.348291
elementType: S P O N C H
totalener: -1541.03307108 hartree
nucrepener: 1955.69302637 hartree
electener: -3496.72609745 hartree
oneelecener: -6001.23369889 hartree
twoeener: 2504.50760144 hartree
cpcmener: -0.05463669 hartree
kineticenergy: 1535.94328731 hartree
xcener: -113.723129872251 hartree
chargesum: -0.0000000
charge: -0.179030 0.764798 -0.352999 -0.643722 -0.109367 -0.086850 -0.454410 -0.272752 -0.099355 -0.038028 0.336555 -0.070326 -0.237529 -0.100300 0.031597 -0.078759 -0.252739 -0.268438 0.009715 0.127565 0.134531 0.112328 0.120373 0.105919 0.105896 0.091353 0.100789 0.081774 0.129761 0.112554 0.113112 0.093689 0.067568 0.075545 0.085825 0.102189 0.063784 0.081282 0.100214 0.095888
qa: -0.1790 0.7648 -0.3530 -0.6437 -0.1094 -0.0869 -0.4544 -0.2728 -0.0994 -0.0380 0.3366 -0.0703 -0.2375 -0.1003 0.0316 -0.0788 -0.2527 -0.2684 0.0097 0.1276 0.1345 0.1123 0.1204 0.1059 0.1059 0.0914 0.1008 0.0818 0.1298 0.1126 0.1131 0.0937 0.0676 0.0755 0.0858 0.1022 0.0638 0.0813 0.1002 0.0959
va: 2.3039 5.4096 2.1098 1.9409 3.0584 3.2890 2.8889 3.1293 3.9153 3.9088 4.1180 3.8682 3.9115 3.8634 3.8825 3.8707 3.9322 3.9379 4.4196 1.0031 0.9987 0.9999 0.9984 0.9999 1.0057 1.0054 1.0063 1.0099 1.0056 1.0336 0.9864 0.9970 1.0120 1.0091 1.0027 1.0094 1.0069 1.0071 1.0077 1.0058
dispcorr: -0.022876879 hartree
energy: -1541.055947956700
dipole: -8.83516 7.75252 -1.08264 -15.53011 11.43109 -4.09902 4.79331 -4.22084 0.57247
magnitude: 4.27806 au
magnitude: 10.87397 debye
