program: Orca
programVersion: 5.0.4
elementType: S P O O N N N N C C C C C C C C C C C H H H H H H H H H H H H H H H H H H H H H
charge: 0
multiplicity: 1
keywords: wb97x-d3
keywords: def2-TZVPP
keywords: def2/J RIJCOSX
keywords: DEFGRID2
keywords: scfconv7
keywords: smallprint printgap noloewdin
keywords: NOSOSCF
formula: C11H21N4O2PS
InChI: InChI=1/C11H21N4O2PS/c1-4-9-19-18(16,17-6-3)15-8-7-14(5-2)11(15)13-10-12/h4-9H2,1-3H3
40 atoms
S  1.596655 0.316791 1.584864
P  0.977317 -0.552022 -0.191184
O  1.07001 0.65286 -1.223312
O  1.700105 -1.796328 -0.56326
N  -0.669659 -0.914764 -0.023624
N  -2.754932 -0.707361 0.680495
N  -1.343315 1.230601 0.464158
N  -2.770508 3.128673 1.112305
C  -1.132091 -2.292172 0.180008
C  -2.636225 -2.092751 0.240189
C  -1.636504 -0.0361 0.388314
C  -4.079878 -0.119947 0.809122
C  -4.677938 0.311035 -0.517738
C  3.313854 -0.322443 1.651711
C  0.570795 0.525032 -2.576461
C  4.253865 0.338875 0.661122
C  1.205664 1.605945 -3.410714
C  5.671476 -0.19239 0.812617
C  -2.159645 2.181536 0.819184
H  -0.833609 -2.937825 -0.639896
H  -0.740528 -2.694437 1.115437
H  -3.11705 -2.76461 0.94751
H  -3.102529 -2.223568 -0.739156
H  -4.704998 -0.87932 1.277407
H  -4.04226 0.709718 1.512051
H  -4.08495 1.090077 -0.997587
H  -4.762809 -0.527369 -1.20896
H  -5.679131 0.708715 -0.352735
H  3.293457 -1.405456 1.538339
H  3.623143 -0.112176 2.677067
H  -0.514836 0.631792 -2.556774
H  0.811866 -0.462949 -2.973032
H  4.23897 1.419433 0.815346
H  3.90885 0.163311 -0.359971
H  6.05765 -0.01746 1.817939
H  5.716566 -1.265328 0.62035
H  6.345747 0.297125 0.109857
H  0.826968 1.537887 -4.430257
H  0.96461 2.598808 -3.030701
H  2.289623 1.498339 -3.447027
elementType: S P O N C H
totalener: -1541.03654959 hartree
nucrepener: 1902.50524531 hartree
electener: -3443.54179490 hartree
oneelecener: -5895.35992514 hartree
twoeener: 2451.81813024 hartree
cpcmener: -0.05172364 hartree
kineticenergy: 1535.94780464 hartree
xcener: -113.714659236924 hartree
chargesum: 0.0000000
charge: -0.185021 0.787021 -0.342508 -0.651617 -0.140800 -0.140474 -0.458326 -0.266741 -0.068878 -0.032138 0.380956 -0.053932 -0.246043 -0.074776 0.028393 -0.095222 -0.246716 -0.272227 0.013353 0.118549 0.117793 0.113119 0.107895 0.102233 0.106286 0.083947 0.093144 0.102778 0.111014 0.130473 0.104157 0.109566 0.067882 0.062682 0.085483 0.085014 0.094474 0.090346 0.089731 0.089128
qa: -0.1850 0.7870 -0.3425 -0.6516 -0.1408 -0.1405 -0.4583 -0.2667 -0.0689 -0.0321 0.3810 -0.0539 -0.2460 -0.0748 0.0284 -0.0952 -0.2467 -0.2722 0.0134 0.1185 0.1178 0.1131 0.1079 0.1022 0.1063 0.0839 0.0931 0.1028 0.1110 0.1305 0.1042 0.1096 0.0679 0.0627 0.0855 0.0850 0.0945 0.0903 0.0897 0.0891
va: 2.2987 5.3861 2.0783 1.9475 3.1835 3.3127 2.8849 3.1249 3.9338 3.9300 4.0914 3.8832 3.9109 3.8534 3.8531 3.8915 3.9572 3.9549 4.4134 1.0104 1.0061 1.0033 0.9981 0.9997 1.0074 1.0076 1.0048 1.0068 1.0296 1.0027 0.9918 0.9967 1.0147 1.0280 1.0002 1.0012 1.0032 1.0063 1.0028 1.0048
dispcorr: -0.019838433 hartree
energy: -1541.056388018662
dipole: 4.49007 -5.28052 -0.79046 -4.31873 0.88306 -3.43566 -9.40646 8.41109 -0.99536
magnitude: 3.66324 au
magnitude: 9.31123 debye
