program: Orca
programVersion: 5.0.4
elementType: S P O O N N N N C C C C C C C C C C C H H H H H H H H H H H H H H H H H H H H H
charge: 0
multiplicity: 1
keywords: wb97x-d3
keywords: def2-TZVPP
keywords: def2/J RIJCOSX
keywords: DEFGRID2
keywords: scfconv7
keywords: smallprint printgap noloewdin
keywords: NOSOSCF
formula: C11H21N4O2PS
InChI: InChI=1/C11H21N4O2PS/c1-4-9-19-18(16,17-6-3)15-8-7-14(5-2)11(15)13-10-12/h4-9H2,1-3H3
40 atoms
S  1.441697 0.458804 1.479405
P  0.8856 -0.464935 -0.289947
O  0.94327 0.722909 -1.343263
O  1.660846 -1.685213 -0.63787
N  -0.750415 -0.887886 -0.129257
N  -2.819908 -0.751605 0.63933
N  -1.471914 1.229104 0.403093
N  -2.920902 3.073583 1.150426
C  -1.16417 -2.280646 0.077124
C  -2.671862 -2.128351 0.179807
C  -1.730721 -0.045103 0.322788
C  -4.156523 -0.203761 0.813953
C  -4.798203 0.243225 -0.486905
C  3.169554 -0.143618 1.596168
C  0.812063 0.479675 -2.76537
C  4.118292 0.496867 0.60021
C  2.103083 0.840654 -3.452666
C  5.542201 0.003516 0.809715
C  -2.297874 2.149927 0.811359
H  -0.867806 -2.911681 -0.75489
H  -0.736419 -2.676948 0.999268
H  -3.112374 -2.821886 0.892542
H  -3.161283 -2.262803 -0.787866
H  -4.749496 -0.991308 1.277603
H  -4.124078 0.60922 1.536665
H  -4.869841 -0.578576 -1.199424
H  -5.808204 0.602127 -0.289431
H  -4.242823 1.055021 -0.957409
H  3.172008 -1.230333 1.522305
H  3.456526 0.10908 2.61858
H  -0.011757 1.104665 -3.108461
H  0.544231 -0.560162 -2.962088
H  4.076934 1.582516 0.706472
H  3.803501 0.269548 -0.420713
H  5.902246 0.238518 1.812682
H  5.61178 -1.077197 0.676176
H  6.223122 0.46839 0.096587
H  1.987212 0.712971 -4.529039
H  2.376571 1.87966 -3.26712
H  2.921187 0.199519 -3.123322
elementType: S P O N C H
totalener: -1541.03573582 hartree
nucrepener: 1903.00974800 hartree
electener: -3444.04548382 hartree
oneelecener: -5896.50759141 hartree
twoeener: 2452.46210759 hartree
cpcmener: -0.05166460 hartree
kineticenergy: 1535.94332536 hartree
xcener: -113.714296630103 hartree
chargesum: 0.0000000
charge: -0.184354 0.774216 -0.347114 -0.650189 -0.133748 -0.141328 -0.466793 -0.267408 -0.067514 -0.033386 0.386834 -0.051401 -0.247086 -0.077721 0.050496 -0.081661 -0.253965 -0.273856 0.015078 0.118654 0.117513 0.112574 0.108393 0.102072 0.105396 0.093000 0.102752 0.084161 0.111562 0.129821 0.103543 0.096082 0.067688 0.054645 0.086618 0.084675 0.094250 0.099243 0.091785 0.086474
qa: -0.1844 0.7742 -0.3471 -0.6502 -0.1337 -0.1413 -0.4668 -0.2674 -0.0675 -0.0334 0.3868 -0.0514 -0.2471 -0.0777 0.0505 -0.0817 -0.2540 -0.2739 0.0151 0.1187 0.1175 0.1126 0.1084 0.1021 0.1054 0.0930 0.1028 0.0842 0.1116 0.1298 0.1035 0.0961 0.0677 0.0546 0.0866 0.0847 0.0942 0.0992 0.0918 0.0865
va: 2.3021 5.4057 2.0718 1.9362 3.1896 3.3040 2.8907 3.1227 3.9320 3.9297 4.1015 3.8819 3.9118 3.8595 3.8599 3.8988 3.9433 3.9573 4.4123 1.0089 1.0065 1.0034 0.9981 0.9996 1.0075 1.0048 1.0066 1.0075 1.0290 1.0037 0.9948 1.0001 1.0157 1.0215 1.0004 1.0012 1.0033 1.0088 1.0023 1.0059
dispcorr: -0.019956757 hartree
energy: -1541.055692582032
dipole: 7.07547 -7.53779 -0.46233 -6.03508 2.46674 -3.56834 -9.00855 7.90774 -1.10081
magnitude: 3.76279 au
magnitude: 9.56424 debye
