program: Orca
programVersion: 5.0.4
elementType: S P O O N N N N C C C C C C C C C C C H H H H H H H H H H H H H H H H H H H H H
charge: 0
multiplicity: 1
keywords: wb97x-d3
keywords: def2-TZVPP
keywords: def2/J RIJCOSX
keywords: DEFGRID2
keywords: scfconv7
keywords: smallprint printgap noloewdin
keywords: NOSOSCF
formula: C11H21N4O2PS
InChI: InChI=1/C11H21N4O2PS/c1-4-9-19-18(16,17-6-3)15-8-7-14(5-2)11(15)13-10-12/h4-9H2,1-3H3
40 atoms
S  1.822015 1.055473 0.249473
P  1.015058 -0.461932 -0.908469
O  0.610076 0.258565 -2.268157
O  1.87988 -1.665431 -1.010857
N  -0.488419 -0.910637 -0.290009
N  -2.532431 -0.78683 0.531365
N  -1.413292 1.193747 -0.255726
N  -2.93595 3.057326 0.256139
C  -0.840288 -2.303994 -0.003441
C  -2.08889 -2.138208 0.851469
C  -1.52695 -0.075624 0.011013
C  -3.685697 -0.238355 1.2252
C  -3.378175 0.226685 2.637231
C  2.925421 0.095095 1.349113
C  1.608854 0.841689 -3.138387
C  2.196731 -0.722078 2.400006
C  0.965609 1.11085 -4.472671
C  3.185457 -1.397573 3.338726
C  -2.271564 2.123335 0.048149
H  -1.044856 -2.84121 -0.929082
H  -0.045469 -2.81475 0.532814
H  -1.865777 -2.223168 1.917185
H  -2.859189 -2.864385 0.60076
H  -4.115189 0.565387 0.630688
H  -4.436353 -1.02817 1.243842
H  -2.628494 1.018414 2.649968
H  -4.28558 0.617399 3.097167
H  -3.017625 -0.592437 3.259384
H  3.542224 0.862857 1.820573
H  3.587543 -0.519079 0.740078
H  2.451367 0.156116 -3.244238
H  1.9753 1.765306 -2.687797
H  1.572995 -1.480883 1.921696
H  1.524974 -0.07305 2.965099
H  3.807928 -0.66497 3.854783
H  2.664813 -1.982361 4.097026
H  3.848345 -2.074292 2.797596
H  0.129116 1.803732 -4.381959
H  1.70301 1.562815 -5.135758
H  0.612791 0.19236 -4.940831
elementType: S P O N C H
totalener: -1541.03631751 hartree
nucrepener: 1915.65606365 hartree
electener: -3456.69238116 hartree
oneelecener: -5921.56787544 hartree
twoeener: 2464.87549427 hartree
cpcmener: -0.05094596 hartree
kineticenergy: 1535.95256878 hartree
xcener: -113.719986263234 hartree
chargesum: -0.0000000
charge: -0.188213 0.762272 -0.356214 -0.646838 -0.092062 -0.143702 -0.458796 -0.272461 -0.088536 -0.020904 0.373117 -0.052700 -0.249608 -0.067649 0.024605 -0.089656 -0.248212 -0.272614 0.017466 0.125752 0.124651 0.105908 0.112962 0.105914 0.101761 0.083077 0.102457 0.093857 0.128570 0.109546 0.109143 0.101099 0.063418 0.067088 0.086596 0.093862 0.085694 0.089697 0.090096 0.089553
qa: -0.1882 0.7623 -0.3562 -0.6468 -0.0921 -0.1437 -0.4588 -0.2725 -0.0885 -0.0209 0.3731 -0.0527 -0.2496 -0.0676 0.0246 -0.0897 -0.2482 -0.2726 0.0175 0.1258 0.1247 0.1059 0.1130 0.1059 0.1018 0.0831 0.1025 0.0939 0.1286 0.1095 0.1091 0.1011 0.0634 0.0671 0.0866 0.0939 0.0857 0.0897 0.0901 0.0896
va: 2.2933 5.4320 2.1324 1.9476 3.1258 3.2916 2.9150 3.1234 3.9229 3.9083 4.1408 3.8830 3.9114 3.8408 3.8580 3.9024 3.9718 3.9631 4.4146 1.0052 1.0002 0.9988 1.0032 1.0061 0.9999 1.0084 1.0067 1.0046 1.0035 1.0293 0.9923 0.9954 1.0111 1.0158 1.0010 1.0033 1.0006 1.0028 1.0062 1.0048
dispcorr: -0.020075985 hartree
energy: -1541.056393496855
dipole: 2.29587 -1.91014 0.38573 -9.10790 5.82548 -3.28242 11.35074 -10.19372 1.15702
magnitude: 3.50168 au
magnitude: 8.90057 debye
