program: Orca
programVersion: 5.0.4
elementType: S P O O N N N N C C C C C C C C C C C H H H H H H H H H H H H H H H H H H H H H
charge: 0
multiplicity: 1
keywords: wb97x-d3
keywords: def2-TZVPP
keywords: def2/J RIJCOSX
keywords: DEFGRID2
keywords: scfconv7
keywords: smallprint printgap noloewdin
keywords: NOSOSCF
formula: C11H21N4O2PS
InChI: InChI=1/C11H21N4O2PS/c1-4-9-19-18(16,17-6-3)15-8-7-14(5-2)11(15)13-10-12/h4-9H2,1-3H3
40 atoms
S  2.12077 1.009497 0.565789
P  1.322091 -0.220769 -0.893206
O  1.169479 0.859233 -2.049516
O  2.11252 -1.44262 -1.196038
N  -0.247751 -0.701605 -0.474507
N  -2.284582 -0.607043 0.383573
N  -1.062992 1.413141 -0.086856
N  -2.557413 3.23935 0.611159
C  -0.683023 -2.099658 -0.424986
C  -1.907835 -2.013517 0.47442
C  -1.241558 0.124114 -0.028591
C  -3.357547 -0.115381 1.235054
C  -2.921541 0.149591 2.66543
C  3.143575 -0.159739 1.543951
C  0.30129 0.677303 -3.191665
C  2.48311 -0.632705 2.82581
C  0.651486 -0.527255 -4.031129
C  1.215365 -1.442963 2.622692
C  -1.90907 2.320344 0.309015
H  -0.933987 -2.44827 -1.426953
H  0.083736 -2.747117 -0.009961
H  -1.674022 -2.278174 1.508521
H  -2.718073 -2.652091 0.129148
H  -3.799587 0.772425 0.78759
H  -4.13664 -0.87674 1.214294
H  -2.142347 0.91032 2.722441
H  -3.774017 0.504109 3.244691
H  -2.548779 -0.755154 3.145881
H  4.050822 0.401882 1.767055
H  3.43357 -0.99359 0.905845
H  0.420456 1.592929 -3.767348
H  -0.735446 0.631911 -2.854095
H  2.280841 0.223252 3.473362
H  3.227604 -1.240901 3.347555
H  0.401957 -0.825974 2.238435
H  1.376297 -2.268607 1.926595
H  0.875024 -1.870107 3.566216
H  1.702641 -0.525522 -4.31866
H  0.424867 -1.468423 -3.529755
H  0.05696 -0.494245 -4.944463
elementType: S P O N C H
totalener: -1541.03428200 hartree
nucrepener: 1968.82481402 hartree
electener: -3509.85909602 hartree
oneelecener: -6027.40670754 hartree
twoeener: 2517.54761152 hartree
cpcmener: -0.05356127 hartree
kineticenergy: 1535.94086589 hartree
xcener: -113.721417339442 hartree
chargesum: -0.0000000
charge: -0.176254 0.764022 -0.352370 -0.642654 -0.098922 -0.107867 -0.446143 -0.267057 -0.090399 -0.058087 0.328966 -0.045276 -0.263006 -0.103493 0.030031 -0.078820 -0.253225 -0.265207 0.009659 0.126608 0.132465 0.116064 0.117902 0.105905 0.102380 0.086303 0.108455 0.093860 0.129650 0.113857 0.113589 0.094965 0.068487 0.076798 0.056598 0.089090 0.103903 0.096493 0.081409 0.101318
qa: -0.1763 0.7640 -0.3524 -0.6427 -0.0989 -0.1079 -0.4461 -0.2671 -0.0904 -0.0581 0.3290 -0.0453 -0.2630 -0.1035 0.0300 -0.0788 -0.2532 -0.2652 0.0097 0.1266 0.1325 0.1161 0.1179 0.1059 0.1024 0.0863 0.1085 0.0939 0.1296 0.1139 0.1136 0.0950 0.0685 0.0768 0.0566 0.0891 0.1039 0.0965 0.0814 0.1013
va: 2.3037 5.4078 2.1077 1.9432 3.0709 3.2748 2.8884 3.1290 3.9007 3.9352 4.1304 3.8697 3.9125 3.8684 3.8824 3.8740 3.9298 3.9477 4.4169 1.0022 1.0029 0.9918 1.0075 1.0074 0.9995 1.0057 1.0085 1.0041 1.0056 1.0338 0.9861 0.9952 1.0122 1.0092 0.9969 0.9995 1.0088 1.0060 1.0063 1.0077
dispcorr: -0.023697484 hartree
energy: -1541.057979482430
dipole: -6.36022 5.40252 -0.95770 -15.32793 11.27941 -4.04852 9.18310 -8.62627 0.55684
magnitude: 4.19736 au
magnitude: 10.66883 debye
