program: Orca
programVersion: 5.0.4
elementType: S P O O N N N N C C C C C C C C C C C H H H H H H H H H H H H H H H H H H H H H
charge: 0
multiplicity: 1
keywords: wb97x-d3
keywords: def2-TZVPP
keywords: def2/J RIJCOSX
keywords: DEFGRID2
keywords: scfconv7
keywords: smallprint printgap noloewdin
keywords: NOSOSCF
formula: C11H21N4O2PS
InChI: InChI=1/C11H21N4O2PS/c1-4-9-19-18(16,17-6-3)15-8-7-14(5-2)11(15)13-10-12/h4-9H2,1-3H3
40 atoms
S  2.256908 0.913428 0.472112
P  1.345489 -0.273704 -0.951507
O  1.172554 0.81458 -2.094953
O  2.078053 -1.5219 -1.289532
N  -0.206703 -0.704079 -0.427402
N  -2.185865 -0.556052 0.547035
N  -0.997375 1.434297 -0.099401
N  -2.460802 3.292194 0.581756
C  -0.670001 -2.090475 -0.316209
C  -1.795642 -1.953853 0.693733
C  -1.169813 0.151008 0.037327
C  -3.234049 -0.024458 1.404183
C  -2.761299 0.318481 2.805653
C  3.043642 -0.370586 1.519475
C  0.259653 0.660818 -3.206439
C  2.092637 -1.281959 2.275513
C  0.57957 -0.523368 -4.08559
C  1.084552 -0.563001 3.153932
C  -1.821649 2.360623 0.298666
H  -1.029593 -2.442921 -1.283461
H  0.114645 -2.756201 0.030106
H  -1.455453 -2.150091 1.71409
H  -2.632446 -2.61297 0.473684
H  -3.69399 0.836925 0.924097
H  -4.008869 -0.789287 1.445975
H  -2.003831 1.10258 2.802584
H  -3.606488 0.676526 3.393439
H  -2.348775 -0.552114 3.315926
H  3.641121 0.219457 2.216956
H  3.737109 -0.941708 0.904582
H  0.356598 1.590309 -3.763615
H  -0.762836 0.605893 -2.829517
H  2.720476 -1.928565 2.894671
H  1.582342 -1.951872 1.581125
H  1.5814 0.078862 3.88365
H  0.409515 0.064265 2.571273
H  0.474471 -1.279453 3.704369
H  -0.048671 -0.470725 -4.975124
H  1.619168 -0.512732 -4.412202
H  0.373543 -1.475711 -3.597036
elementType: S P O N C H
totalener: -1541.03537708 hartree
nucrepener: 1976.45900023 hartree
electener: -3517.49437732 hartree
oneelecener: -6042.54010277 hartree
twoeener: 2525.04572545 hartree
cpcmener: -0.05502903 hartree
kineticenergy: 1535.94478776 hartree
xcener: -113.722587469808 hartree
chargesum: 0.0000000
charge: -0.177038 0.762748 -0.355470 -0.644442 -0.087939 -0.104588 -0.435668 -0.266999 -0.080799 -0.052104 0.306400 -0.041176 -0.269568 -0.097811 0.029907 -0.122785 -0.251751 -0.262865 0.011312 0.123528 0.130329 0.111903 0.119198 0.105628 0.101286 0.083850 0.110340 0.092854 0.128893 0.123323 0.113320 0.095386 0.090500 0.072848 0.103339 0.055655 0.099823 0.100917 0.096113 0.081601
qa: -0.1770 0.7627 -0.3555 -0.6444 -0.0879 -0.1046 -0.4357 -0.2670 -0.0808 -0.0521 0.3064 -0.0412 -0.2696 -0.0978 0.0299 -0.1228 -0.2518 -0.2629 0.0113 0.1235 0.1303 0.1119 0.1192 0.1056 0.1013 0.0839 0.1103 0.0929 0.1289 0.1233 0.1133 0.0954 0.0905 0.0728 0.1033 0.0557 0.0998 0.1009 0.0961 0.0816
va: 2.2981 5.4090 2.1084 1.9405 3.0678 3.2786 2.8844 3.1295 3.9046 3.9327 4.1320 3.8596 3.9200 3.8647 3.8792 3.8774 3.9308 3.9352 4.4146 1.0038 1.0015 0.9941 1.0066 1.0073 0.9999 1.0019 1.0104 1.0017 1.0030 1.0250 0.9861 0.9955 1.0096 1.0126 1.0052 0.9983 1.0040 1.0073 1.0059 1.0080
dispcorr: -0.024343975 hartree
energy: -1541.059721059855
dipole: -7.55213 6.47155 -1.08058 -13.76494 9.72521 -4.03973 10.73156 -9.87892 0.85264
magnitude: 4.26779 au
magnitude: 10.84787 debye
