program: Gaussian 09
title: 000065746
version: EM64L-G09RevD.01
frameworkgroup: C1[X(C10H9NO)]
method: RPBEPBE
basis: SDD
operation: Freq
keyword: #p
keyword: freq=noraman
keyword: PBEPBE/SDD
title: #p freq=noraman PBEPBE/SDD
converged: YES YES NO NO
title: Mulliken charges:
elementType: O N C C C C C C C C C C H H H H H H H H H
charge: -0.425145 -0.694710 0.265650 0.324533 0.323495 0.093758 -0.404650 -0.420727 -0.460273 -0.248429 -0.384009 -0.236338 0.193300 0.180198 0.214715 0.221331 0.249801 0.225778 0.316065 0.310056 0.355601
chargesum: 0.00000
title: Mulliken charges with hydrogens summed into heavy atoms:
elementType: O N C C C C C C C C C C
charge: -0.069543 -0.068589 0.265650 0.324533 0.323495 0.093758 -0.211350 -0.240528 -0.245558 -0.027098 -0.134209 -0.010559
polarizability: 1.64646494e+02 -7.37852421e+00 1.50125481e+02 -1.50949010e-02 5.15634024e-03 4.77407142e+01
1716.lowfreq: -11.7841 -8.3488 -0.0011 -0.0009 -0.0006 7.0451 58.9109 149.4229 171.3359
frequency: 58.9045 149.4201 171.3358 243.6543 272.8163 283.1294 318.3026 353.3572 401.4193 452.3487 467.3948 496.8219 510.4454 511.7311 531.3114 584.5024 638.4637 671.6369 703.6197 753.1864 771.6482 801.6839 847.4096 848.5713 873.0615 916.1656 946.2680 953.5732 1015.9763 1072.7547 1107.5050 1142.9326 1163.7232 1185.8461 1206.5244 1244.3138 1279.3770 1318.6601 1385.6601 1416.1643 1425.5381 1449.0207 1465.1910 1535.5320 1593.7695 1598.4751 1635.9109 1645.7648 3096.3182 3121.6705 3127.3673 3150.8941 3152.2330 3175.5548 3577.6589 3588.0640 3716.6625
redmass: 2.9167 1.9288 3.5374 2.4631 4.7028 1.8497 1.3663 4.0715 1.1522 6.6021 3.3938 4.0316 4.9667 4.1814 6.0584 2.9124 6.2062 4.0049 1.3148 1.4091 5.6141 4.4659 1.4904 4.3442 1.4300 4.6109 1.3326 1.3396 1.7936 2.2586 1.5142 1.3669 1.5198 1.2620 1.8217 1.7964 2.0586 1.9737 3.1541 3.7494 3.7076 2.8735 2.8269 4.6523 4.9864 6.5152 6.0994 1.2400 1.0875 1.0890 1.0854 1.0939 1.0977 1.0967 1.0454 1.0652 1.1029
irintensity: 15.1183 3.1745 0.7671 53.8802 4.1561 33.6776 174.0316 2.6165 118.4875 1.0324 0.0653 4.5921 14.3083 1.6154 4.0652 14.5480 7.0763 2.1335 4.1077 185.7950 4.7335 3.6697 8.8987 0.3571 4.7221 30.6096 1.5460 1.9492 3.2752 68.5049 32.9206 130.1325 24.6598 6.8200 56.8134 2.3733 4.8622 16.0954 82.0007 0.6364 56.3508 35.2173 4.1096 159.3589 47.4186 3.5589 0.8761 240.4970 14.0820 23.4075 8.8330 40.5557 20.8676 11.3661 58.0694 21.9800 20.7989
temp: 298.150 k
press: 1.00000 atm
elementType: 8 7 6 6 6 6 6 6 6 6 6 6 1 1 1 1 1 1 1 1 1
symmnumber: 1
zpe: 431416.7 jmol-1
zpe.correction: 0.164318 hartree
zpe.thermalcorrener: 0.174426 hartree
zpe.thermalcorrenthalpy: 0.175371 hartree
zpe.thermalcorrgfe: 0.129220 hartree
zpe.sumelectzpe: -515.610982 hartree
zpe.sumelectthermal: -515.600874 hartree
zpe.sumelectthermalent: -515.599930 hartree
zpe.sumelectthermalfe: -515.646081 hartree
dipole: 3.1094 0.7478 0.0079
dipole: 3.1980
quadrupole: -62.1425 -55.2538 -77.0716
quadrupole: 3.5309 0.0358 0.0218
quadrupole: 2.6801 9.5688 -12.2489 3.5309 0.0358 0.0218
hfenergy: -515.7753004 hartree
pointgroup: C01 [X(C10H9N1O1)]
dipole: 1.1859961 0.4198253 -0.0156347 debye
dipolederiv: -0.562722 -0.5377915 0.0090124 -0.7021516 -0.9479277 0.0153821 0.0116757 0.0139348 -0.4109114 -0.6386962 -0.5891771 0.0081593 -0.7702534 -0.9871577 0.0138967 0.0134411 0.0143245 -0.7117573 -0.1115994 -0.3849657 0.0071971 -0.0616263 0.0542608 0.0001588 0.00251 0.0038724 0.0149826 -0.0729555 -0.3181325 0.0058581 -0.2271375 0.0977885 0.0013884 0.0048828 0.002463 0.0319636 0.5205922 0.6108834 -0.0133619 0.9255463 1.0145196 -0.0235336 -0.0180327 -0.0202224 0.1265173 0.4252003 0.545386 -0.0115942 0.7358235 0.9072883 -0.0198275 -0.0143279 -0.0179596 0.0616218 -0.2022609 0.1103446 -0.0024382 0.0201558 -0.1039295 -0.002493 -0.0012957 -0.0039482 -0.2259803 -0.3829083 0.0825536 -0.0003744 0.1062044 -0.1592536 -0.0030722 -0.0009998 -0.0030768 -0.2650472 0.0491153 0.1843309 -0.0060726 -0.4853218 -0.4084669 0.0073456 0.0035135 -0.0001075 -0.2627854 0.3464709 0.0028516 -0.0050382 0.2647125 0.2033043 -0.0079224 -0.0089443 -0.0051277 -0.1221695 0.0466951 0.1448245 -0.0047703 -0.2857529 -0.2531417 0.003655 0.0015722 -0.0009671 -0.1973331 0.1501226 -0.0715565 -0.0021086 0.1819061 0.147868 -0.0065659 -0.0058974 -0.0038328 -0.1535392 -0.0011617 -0.139763 0.0041052 -0.0735386 -0.0817436 0.0047531 0.0032096 0.0058435 0.1666765 -0.0249931 -0.1521908 0.0045993 -0.0897944 -0.0831758 0.0050873 0.0038213 0.0060185 0.1749888 -0.1675148 0.0022815 0.0035636 -0.031288 0.0750613 0.0018574 0.0039778 0.0014088 0.1749608 0.0398989 0.0983946 -0.0002563 0.1024371 -0.0895942 0.0026571 -0.0004131 0.0028321 0.1548319 -0.0848794 0.0004622 0.0027621 -0.0038558 0.1014726 0.0011665 0.0026699 0.0010663 0.1756898 0.0369487 0.0914107 -0.0000408 0.100616 -0.0866478 0.0026794 -0.0002662 0.0028741 0.1589382 0.1888845 0.0656835 0.0013746 0.0662415 0.1835274 0.0014064 0.0003659 -0.0001781 0.3673669 0.1751988 0.0574266 0.0010012 0.0590225 0.1647742 0.0022763 -0.0001967 0.0016303 0.3793288 0.2705642 0.1967435 -0.0015774 0.1680545 0.2511736 -0.0002953 -0.0012659 -0.0008481 0.3616564 unknown
polarizability: 166.0041862|-5.7320563|148.7337459|-1.1754401|-1.4437757|47.7747575 unknown
InChI: InChI=1S/C10H9NO/c11-9-5-1-4-8-7(9)3-2-6-10(8)12/h1-6,12H,11H2
charge 0 multiplicity 1
21 atoms
O  -2.643185 -1.648418 0.074019
N  2.614313 1.691927 -0.03088
C  0.386798 0.619827 0.008562
C  -0.377734 -0.611654 0.035395
C  1.838352 0.53472 -0.005368
C  -1.818854 -0.510674 0.049057
C  -0.304239 1.874895 -0.0033
C  0.296866 -1.876994 0.047643
C  2.46367 -0.729568 0.0066
C  1.693748 -1.922293 0.032956
C  -2.469416 0.725566 0.037961
C  -1.701868 1.922945 0.0115
H  0.247194 2.821159 -0.025051
H  -0.256677 -2.824865 0.069127
H  3.558603 -0.790948 -0.004219
H  2.209876 -2.888563 0.042339
H  -3.5627 0.748532 0.049301
H  -2.21885 2.888284 0.002307
H  2.199351 2.616812 -0.036171
H  3.627618 1.623665 -0.038781
H  -2.107566 -2.479156 0.079303
