program: Orca
programVersion: 5.0.4
elementType: S P O O N N N N C C C C C C C C C C C H H H H H H H H H H H H H H H H H H H H H
charge: 0
multiplicity: 1
keywords: wb97x-d3
keywords: def2-TZVPP
keywords: def2/J RIJCOSX
keywords: DEFGRID2
keywords: scfconv7
keywords: smallprint printgap noloewdin
keywords: NOSOSCF
formula: C11H21N4O2PS
InChI: InChI=1/C11H21N4O2PS/c1-4-9-19-18(16,17-6-3)15-8-7-14(5-2)11(15)13-10-12/h4-9H2,1-3H3
40 atoms
S  2.422857 0.823312 0.342353
P  1.379724 -0.369255 -0.984542
O  1.149882 0.709316 -2.12954
O  2.041369 -1.640769 -1.377719
N  -0.126164 -0.765065 -0.318827
N  -1.97172 -0.591503 0.873092
N  -0.919114 1.380532 -0.004766
N  -2.331333 3.238208 0.778583
C  -0.592507 -2.147348 -0.173703
C  -1.6503 -2.010297 0.910385
C  -1.048981 0.10065 0.209421
C  -3.105807 -0.074772 1.618621
C  -4.352176 0.092999 0.771048
C  3.0927 -0.4520 1.477535
C  0.859213 0.322429 -3.493539
C  2.073284 -1.132375 2.372757
C  -0.446222 -0.418003 -3.643329
C  1.263922 -0.182956 3.237504
C  -1.711787 2.306859 0.452561
H  -1.016847 -2.496725 -1.116005
H  0.209036 -2.81866 0.11976
H  -1.270769 -2.281567 1.898339
H  -2.531789 -2.613521 0.700922
H  -3.292123 -0.787104 2.422414
H  -2.832634 0.858828 2.10739
H  -5.173046 0.449052 1.393306
H  -4.200584 0.81466 -0.031697
H  -4.656034 -0.854749 0.325682
H  3.812966 0.108761 2.076021
H  3.656925 -1.174315 0.889858
H  1.691762 -0.265666 -3.880994
H  0.831885 1.263559 -4.038764
H  2.635775 -1.818334 3.011801
H  1.410082 -1.762663 1.777919
H  1.91187 0.407409 3.887768
H  0.677451 0.515153 2.63937
H  0.571372 -0.734759 3.873257
H  -0.416931 -1.412558 -3.19702
H  -1.277351 0.137769 -3.210731
H  -0.648844 -0.545942 -4.706284
elementType: S P O N C H
totalener: -1541.03304318 hartree
nucrepener: 1966.26225520 hartree
electener: -3507.29529838 hartree
oneelecener: -6022.34858934 hartree
twoeener: 2515.05329096 hartree
cpcmener: -0.05566611 hartree
kineticenergy: 1535.94877367 hartree
xcener: -113.723371771700 hartree
chargesum: -0.0000000
charge: -0.178108 0.760821 -0.359293 -0.647038 -0.083991 -0.063498 -0.441244 -0.274131 -0.085619 -0.053080 0.284003 -0.073006 -0.235670 -0.108045 0.035217 -0.111617 -0.266738 -0.272808 0.013275 0.127199 0.126970 0.110816 0.125637 0.107537 0.105263 0.099731 0.080890 0.090710 0.128521 0.125687 0.102850 0.110348 0.091622 0.068805 0.099298 0.071386 0.097034 0.089663 0.091311 0.109295
qa: -0.1781 0.7608 -0.3593 -0.6470 -0.0840 -0.0635 -0.4412 -0.2741 -0.0856 -0.0531 0.2840 -0.0730 -0.2357 -0.1080 0.0352 -0.1116 -0.2667 -0.2728 0.0133 0.1272 0.1270 0.1108 0.1256 0.1075 0.1053 0.0997 0.0809 0.0907 0.1285 0.1257 0.1029 0.1103 0.0916 0.0688 0.0993 0.0714 0.0970 0.0897 0.0913 0.1093
va: 2.2868 5.4134 2.0948 1.9406 3.0562 3.2539 2.8943 3.1248 3.9160 3.9097 4.1640 3.8637 3.9153 3.8801 3.8538 3.8849 3.9161 3.9328 4.4147 1.0016 1.0052 0.9992 0.9997 0.9995 1.0062 1.0062 1.0097 1.0054 1.0019 1.0232 1.0011 0.9892 1.0092 1.0071 1.0026 1.0083 1.0050 1.0075 1.0063 1.0095
dispcorr: -0.023638776 hartree
energy: -1541.056681957665
dipole: -11.76113 10.96113 -0.80000 -12.99593 8.77938 -4.21654 7.65508 -6.88016 0.77492
magnitude: 4.36116 au
magnitude: 11.08519 debye
