program: Orca
programVersion: 5.0.4
elementType: S P O O N N N N C C C C C C C C C C C H H H H H H H H H H H H H H H H H H H H H
charge: 0
multiplicity: 1
keywords: wb97x-d3
keywords: def2-TZVPP
keywords: def2/J RIJCOSX
keywords: DEFGRID2
keywords: scfconv7
keywords: smallprint printgap noloewdin
keywords: NOSOSCF
formula: C11H21N4O2PS
InChI: InChI=1/C11H21N4O2PS/c1-4-9-19-18(16,17-6-3)15-8-7-14(5-2)11(15)13-10-12/h4-9H2,1-3H3
40 atoms
S  1.393825 0.665135 1.101562
P  0.748262 -0.534826 -0.475308
O  0.545796 0.40166 -1.744839
O  1.568945 -1.758163 -0.66428
N  -0.857952 -0.962324 -0.16183
N  -2.86352 -0.778473 0.748507
N  -1.558835 1.184665 0.25476
N  -2.95602 3.080917 0.968978
C  -1.242128 -2.340094 0.163008
C  -2.738445 -2.184547 0.379959
C  -1.810027 -0.092732 0.295775
C  -4.185393 -0.22111 0.989835
C  -4.937708 0.119481 -0.284057
C  3.01861 -0.09043 1.480825
C  1.577001 1.265199 -2.265714
C  4.134573 0.373141 0.564115
C  2.531723 0.525104 -3.168744
C  5.471931 -0.217451 0.985897
C  -2.356085 2.133829 0.65399
H  -1.010629 -3.020022 -0.650983
H  -0.736901 -2.678768 1.06852
H  -3.111242 -2.82605 1.175359
H  -3.304979 -2.391767 -0.530789
H  -4.73169 -0.968699 1.563951
H  -4.097907 0.64736 1.639597
H  -4.420247 0.877542 -0.872746
H  -5.08091 -0.760352 -0.911144
H  -5.922457 0.511302 -0.030476
H  2.917978 -1.174685 1.489297
H  3.211326 0.221052 2.509071
H  2.104701 1.748017 -1.439905
H  1.044895 2.04042 -2.814169
H  4.186397 1.463653 0.581844
H  3.913563 0.085669 -0.466044
H  5.46265 -1.306694 0.929364
H  6.274467 0.139953 0.341023
H  5.72385 0.059598 2.010534
H  3.114386 -0.220919 -2.629352
H  2.006389 0.03256 -3.986653
H  3.229989 1.24014 -3.603756
elementType: S P O N C H
totalener: -1541.03570764 hartree
nucrepener: 1906.53842393 hartree
electener: -3447.57413157 hartree
oneelecener: -5903.54044615 hartree
twoeener: 2455.96631458 hartree
cpcmener: -0.04928311 hartree
kineticenergy: 1535.95628396 hartree
xcener: -113.720058381153 hartree
chargesum: 0.0000000
charge: -0.193991 0.789935 -0.339611 -0.650397 -0.147638 -0.140654 -0.470197 -0.266680 -0.069783 -0.035235 0.382607 -0.051635 -0.247447 -0.064460 0.032544 -0.091161 -0.249447 -0.273631 0.020689 0.119856 0.118125 0.112706 0.108705 0.101439 0.106537 0.084526 0.092962 0.102243 0.109301 0.127733 0.090193 0.117328 0.069760 0.062150 0.085247 0.093664 0.086223 0.082105 0.096832 0.098558
qa: -0.1940 0.7899 -0.3396 -0.6504 -0.1476 -0.1407 -0.4702 -0.2667 -0.0698 -0.0352 0.3826 -0.0516 -0.2474 -0.0645 0.0325 -0.0912 -0.2494 -0.2736 0.0207 0.1199 0.1181 0.1127 0.1087 0.1014 0.1065 0.0845 0.0930 0.1022 0.1093 0.1277 0.0902 0.1173 0.0698 0.0621 0.0852 0.0937 0.0862 0.0821 0.0968 0.0986
va: 2.2955 5.4382 2.1156 1.9452 3.2091 3.2893 2.8919 3.1249 3.9326 3.9320 4.1287 3.8823 3.9133 3.8439 3.8548 3.9065 3.9178 3.9678 4.4042 1.0073 1.0044 1.0033 0.9978 0.9997 1.0067 1.0074 1.0048 1.0069 1.0318 1.0043 1.0073 0.9939 1.0132 1.0053 1.0007 1.0034 1.0009 1.0113 1.0064 1.0066
dispcorr: -0.020231319 hartree
energy: -1541.055938962036
dipole: 9.95672 -9.73787 0.21885 -5.64575 2.67908 -2.96667 -3.99161 3.84522 -0.14639
magnitude: 2.97833 au
magnitude: 7.57032 debye
