program: Orca
programVersion: 5.0.4
elementType: S P O O N N N N C C C C C C C C C C C H H H H H H H H H H H H H H H H H H H H H
charge: 0
multiplicity: 1
keywords: wb97x-d3
keywords: def2-TZVPP
keywords: def2/J RIJCOSX
keywords: DEFGRID2
keywords: scfconv7
keywords: smallprint printgap noloewdin
keywords: NOSOSCF
formula: C11H21N4O2PS
InChI: InChI=1/C11H21N4O2PS/c1-4-9-19-18(16,17-6-3)15-8-7-14(5-2)11(15)13-10-12/h4-9H2,1-3H3
40 atoms
S  1.451827 0.738718 0.965519
P  0.803082 -0.667434 -0.422592
O  0.604627 0.102214 -1.798123
O  1.626815 -1.903793 -0.448453
N  -0.802771 -1.062159 -0.068934
N  -2.841423 -0.785017 0.738361
N  -1.52966 1.112997 0.048213
N  -2.967614 3.066601 0.464489
C  -1.193161 -2.392558 0.407927
C  -2.697434 -2.224356 0.546577
C  -1.774903 -0.151611 0.239742
C  -4.175212 -0.214159 0.849961
C  -4.876393 -0.043202 -0.485801
C  3.020648 -0.013453 1.539195
C  1.630423 0.929451 -2.392098
C  4.182334 0.169754 0.581078
C  1.180401 2.366542 -2.419702
C  5.478617 -0.349336 1.184955
C  -2.34699 2.09609 0.295276
H  -0.927896 -3.165876 -0.306297
H  -0.722059 -2.61232 1.366795
H  -3.099163 -2.76889 1.39804
H  -3.226719 -2.543864 -0.354157
H  -4.742257 -0.888671 1.490203
H  -4.11961 0.730046 1.387867
H  -4.340726 0.640968 -1.144538
H  -4.991164 -0.995441 -1.003661
H  -5.872776 0.366822 -0.321652
H  2.850237 -1.061305 1.782041
H  3.215368 0.50497 2.480314
H  1.785629 0.543079 -3.398603
H  2.575435 0.827098 -1.854797
H  4.285147 1.228196 0.333116
H  3.977039 -0.354028 -0.354617
H  5.40744 -1.410058 1.430729
H  6.307548 -0.227708 0.487504
H  5.734835 0.187245 2.099704
H  1.075729 2.773055 -1.414356
H  1.925075 2.963431 -2.946431
H  0.231439 2.478503 -2.944107
elementType: S P O N C H
totalener: -1541.03533807 hartree
nucrepener: 1911.70370787 hartree
electener: -3452.73904595 hartree
oneelecener: -5913.95625684 hartree
twoeener: 2461.21721089 hartree
cpcmener: -0.04899847 hartree
kineticenergy: 1535.95817733 hartree
xcener: -113.720357259272 hartree
chargesum: 0.0000000
charge: -0.197925 0.789198 -0.341012 -0.651590 -0.144456 -0.143627 -0.464347 -0.264779 -0.070522 -0.036385 0.381086 -0.053678 -0.247693 -0.053192 0.033570 -0.107762 -0.246129 -0.270415 0.021000 0.119906 0.118783 0.112674 0.109091 0.101788 0.107406 0.084536 0.093192 0.102352 0.109033 0.127374 0.110991 0.097715 0.070157 0.066129 0.084452 0.094050 0.085568 0.078131 0.101568 0.093761
qa: -0.1979 0.7892 -0.3410 -0.6516 -0.1445 -0.1436 -0.4643 -0.2648 -0.0705 -0.0364 0.3811 -0.0537 -0.2477 -0.0532 0.0336 -0.1078 -0.2461 -0.2704 0.0210 0.1199 0.1188 0.1127 0.1091 0.1018 0.1074 0.0845 0.0932 0.1024 0.1090 0.1274 0.1110 0.0977 0.0702 0.0661 0.0845 0.0941 0.0856 0.0781 0.1016 0.0938
va: 2.2852 5.4294 2.1088 1.9499 3.1920 3.2867 2.8979 3.1294 3.9322 3.9312 4.1378 3.8834 3.9126 3.8237 3.8707 3.8942 3.9174 3.9650 4.3964 1.0074 1.0032 1.0031 0.9977 0.9994 1.0064 1.0075 1.0048 1.0069 1.0303 1.0041 1.0001 0.9913 1.0102 1.0197 1.0008 1.0032 1.0006 1.0131 1.0103 1.0039
dispcorr: -0.020397950 hartree
energy: -1541.055736023259
dipole: 7.24293 -7.05718 0.18575 -2.43069 -0.43932 -2.87001 -1.40600 1.70000 0.29401
magnitude: 2.89100 au
magnitude: 7.34835 debye
