program: Orca
programVersion: 5.0.4
elementType: S P O O N N N N C C C C C C C C C C C H H H H H H H H H H H H H H H H H H H H H
charge: 0
multiplicity: 1
keywords: wb97x-d3
keywords: def2-TZVPP
keywords: def2/J RIJCOSX
keywords: DEFGRID2
keywords: scfconv7
keywords: smallprint printgap noloewdin
keywords: NOSOSCF
formula: C11H21N4O2PS
InChI: InChI=1/C11H21N4O2PS/c1-4-9-19-18(16,17-6-3)15-8-7-14(5-2)11(15)13-10-12/h4-9H2,1-3H3
40 atoms
S  2.114363 1.034305 0.644813
P  1.404278 -0.215771 -0.849507
O  1.265313 0.856792 -2.014732
O  2.2177 -1.424616 -1.142158
N  -0.162732 -0.72294 -0.446291
N  -2.254793 -0.649497 0.263521
N  -1.035381 1.383559 -0.152567
N  -2.589958 3.201399 0.423412
C  -0.584048 -2.124609 -0.417546
C  -1.858461 -2.04572 0.409397
C  -1.19627 0.092843 -0.08667
C  -3.394803 -0.162278 1.024562
C  -3.070002 0.136745 2.477504
C  3.18177 -0.099912 1.617199
C  1.110666 0.477672 -3.402905
C  2.523605 -0.647807 2.869023
C  -0.139347 -0.317541 -3.68813
C  1.320474 -1.535648 2.608911
C  -1.912991 2.285683 0.178556
H  -0.778338 -2.480288 -1.430155
H  0.164504 -2.763384 0.041871
H  -1.677383 -2.282597 1.460847
H  -2.63544 -2.708342 0.034226
H  -3.817462 0.709024 0.528334
H  -4.157299 -0.938053 0.962327
H  -3.970965 0.476485 2.98816
H  -2.708843 -0.750377 2.998019
H  -2.316862 0.918891 2.577935
H  4.046389 0.511434 1.87603
H  3.537939 -0.896875 0.965575
H  2.000867 -0.066481 -3.72175
H  1.089839 1.42555 -3.936601
H  2.245832 0.176187 3.529831
H  3.29352 -1.217253 3.397397
H  0.478226 -0.963953 2.216759
H  1.556904 -2.326976 1.895009
H  0.984673 -2.012638 3.529808
H  -1.033689 0.179596 -3.312476
H  -0.242433 -0.413552 -4.769498
H  -0.095785 -1.327393 -3.279945
elementType: S P O N C H
totalener: -1541.03254161 hartree
nucrepener: 1967.82011932 hartree
electener: -3508.85266093 hartree
oneelecener: -6025.58376721 hartree
twoeener: 2516.73110628 hartree
cpcmener: -0.05266611 hartree
kineticenergy: 1535.95005164 hartree
xcener: -113.722761304778 hartree
chargesum: 0.0000000
charge: -0.182617 0.773173 -0.357605 -0.644414 -0.092187 -0.107059 -0.448416 -0.270498 -0.111899 -0.047230 0.331941 -0.050692 -0.258016 -0.100547 0.031211 -0.079064 -0.270845 -0.264234 0.009809 0.133082 0.135458 0.114494 0.117346 0.105773 0.102172 0.106318 0.093887 0.084894 0.130563 0.113136 0.103421 0.110736 0.067992 0.076003 0.059738 0.085321 0.102930 0.091654 0.111834 0.092439
qa: -0.1826 0.7732 -0.3576 -0.6444 -0.0922 -0.1071 -0.4484 -0.2705 -0.1119 -0.0472 0.3319 -0.0507 -0.2580 -0.1005 0.0312 -0.0791 -0.2708 -0.2642 0.0098 0.1331 0.1355 0.1145 0.1173 0.1058 0.1022 0.1063 0.0939 0.0849 0.1306 0.1131 0.1034 0.1107 0.0680 0.0760 0.0597 0.0853 0.1029 0.0917 0.1118 0.0924
va: 2.2851 5.4029 2.1013 1.9449 3.0822 3.2637 2.8940 3.1267 3.9098 3.9173 4.1272 3.8745 3.9111 3.8687 3.8581 3.8746 3.9149 3.9398 4.4205 1.0012 1.0028 0.9946 1.0082 1.0069 0.9993 1.0079 1.0045 1.0072 1.0056 1.0326 0.9998 0.9886 1.0123 1.0093 1.0015 1.0020 1.0094 1.0065 1.0091 1.0075
dispcorr: -0.023564543 hartree
energy: -1541.056106154561
dipole: -6.94139 6.46848 -0.47290 -15.43030 11.25016 -4.18014 8.91361 -8.49723 0.41638
magnitude: 4.22736 au
magnitude: 10.74510 debye
