program: Orca
programVersion: 5.0.4
elementType: S P O O N N N N C C C C C C C C C C C H H H H H H H H H H H H H H H H H H H H H
charge: 0
multiplicity: 1
keywords: wb97x-d3
keywords: def2-TZVPP
keywords: def2/J RIJCOSX
keywords: DEFGRID2
keywords: scfconv7
keywords: smallprint printgap noloewdin
keywords: NOSOSCF
formula: C11H21N4O2PS
InChI: InChI=1/C11H21N4O2PS/c1-4-9-19-18(16,17-6-3)15-8-7-14(5-2)11(15)13-10-12/h4-9H2,1-3H3
40 atoms
S  1.498317 0.423003 1.079915
P  0.865785 -0.900573 -0.394145
O  0.866792 -0.097919 -1.771549
O  1.573067 -2.20749 -0.394387
N  -0.786503 -1.145353 -0.153733
N  -2.937113 -0.697039 0.062224
N  -1.314081 1.081678 -0.02786
N  -2.607183 3.15443 0.270916
C  -1.433151 -2.4565 -0.247425
C  -2.833233 -2.138999 0.261304
C  -1.717967 -0.156908 -0.026997
C  -4.131526 -0.001021 0.515234
C  -4.151676 0.265111 2.010086
C  2.950095 -0.462633 1.766687
C  2.039004 0.600195 -2.249635
C  4.222355 -0.329538 0.950826
C  1.799304 2.08762 -2.246755
C  4.684282 1.10491 0.760363
C  -2.06464 2.132424 0.13958
H  -1.444196 -2.804771 -1.280014
H  -0.929258 -3.193995 0.370464
H  -2.946766 -2.38494 1.319525
H  -3.60487 -2.661044 -0.300103
H  -4.245436 0.921994 -0.049667
H  -4.975767 -0.628968 0.233095
H  -3.326544 0.905436 2.323184
H  -5.081055 0.768286 2.276414
H  -4.098993 -0.661003 2.582391
H  2.684704 -1.5034 1.941855
H  3.076383 0.002233 2.746781
H  2.220935 0.231217 -3.258181
H  2.91567 0.346819 -1.649085
H  4.095807 -0.820819 -0.016264
H  4.995401 -0.894219 1.479595
H  5.629348 1.139644 0.218321
H  3.960474 1.692794 0.193677
H  4.835993 1.602246 1.720214
H  0.936657 2.355634 -2.856887
H  1.645639 2.467335 -1.236967
H  2.672592 2.589372 -2.66395
elementType: S P O N C H
totalener: -1541.03420296 hartree
nucrepener: 1927.01035257 hartree
electener: -3468.04455553 hartree
oneelecener: -5944.54819258 hartree
twoeener: 2476.50363705 hartree
cpcmener: -0.04935024 hartree
kineticenergy: 1535.95058734 hartree
xcener: -113.721635550356 hartree
chargesum: 0.0000000
charge: -0.192210 0.793455 -0.345863 -0.652031 -0.139197 -0.147353 -0.467466 -0.265827 -0.068790 -0.029432 0.385963 -0.052391 -0.249807 -0.078728 0.035762 -0.125962 -0.256239 -0.254465 0.017363 0.119215 0.117979 0.106717 0.112292 0.105880 0.103149 0.083409 0.102378 0.093492 0.119789 0.126623 0.113505 0.094409 0.069887 0.088609 0.095411 0.066529 0.091807 0.100067 0.077604 0.104466
qa: -0.1922 0.7935 -0.3459 -0.6520 -0.1392 -0.1474 -0.4675 -0.2658 -0.0688 -0.0294 0.3860 -0.0524 -0.2498 -0.0787 0.0358 -0.1260 -0.2562 -0.2545 0.0174 0.1192 0.1180 0.1067 0.1123 0.1059 0.1031 0.0834 0.1024 0.0935 0.1198 0.1266 0.1135 0.0944 0.0699 0.0886 0.0954 0.0665 0.0918 0.1001 0.0776 0.1045
va: 2.2725 5.4190 2.0953 1.9544 3.1989 3.2915 2.8878 3.1305 3.9367 3.9214 4.1304 3.8825 3.9129 3.8465 3.8717 3.8953 3.9140 3.9197 4.4051 1.0005 1.0077 0.9980 1.0030 1.0060 0.9992 1.0083 1.0068 1.0046 1.0305 1.0044 1.0010 0.9869 1.0162 1.0088 1.0048 1.0088 1.0021 1.0053 1.0129 1.0086
dispcorr: -0.021203181 hartree
energy: -1541.055406142042
dipole: 7.12633 -7.20118 -0.07484 0.92253 -3.84511 -2.92258 3.28777 -2.98117 0.30661
magnitude: 2.93958 au
magnitude: 7.47181 debye
