program: Orca
programVersion: 5.0.4
elementType: S P O O N N N N C C C C C C C C C C C H H H H H H H H H H H H H H H H H H H H H
charge: 0
multiplicity: 1
keywords: wb97x-d3
keywords: def2-TZVPP
keywords: def2/J RIJCOSX
keywords: DEFGRID2
keywords: scfconv7
keywords: smallprint printgap noloewdin
keywords: NOSOSCF
formula: C11H21N4O2PS
InChI: InChI=1/C11H21N4O2PS/c1-4-9-19-18(16,17-6-3)15-8-7-14(5-2)11(15)13-10-12/h4-9H2,1-3H3
40 atoms
S  1.534144 0.100824 1.670046
P  0.984861 -0.5626 -0.210728
O  1.155361 0.720506 -1.135952
O  1.684766 -1.790325 -0.670801
N  -0.675164 -0.881908 -0.104614
N  -2.799692 -0.653021 0.454075
N  -1.333105 1.254787 0.442565
N  -2.762976 3.16115 1.058505
C  -1.185329 -2.255056 -0.037645
C  -2.686578 -2.017841 -0.047693
C  -1.647145 0.001474 0.278419
C  -4.115176 -0.035611 0.523081
C  -4.613177 0.475378 -0.81701
C  3.305356 -0.374763 1.666041
C  1.217134 0.615229 -2.579812
C  4.181199 0.464706 0.754385
C  -0.084131 0.174307 -3.2040
C  5.648215 0.099424 0.92854
C  -2.153865 2.210527 0.772172
H  -0.856355 -2.844274 -0.888243
H  -0.857442 -2.740656 0.882598
H  -3.220711 -2.710678 0.59864
H  -3.102262 -2.090045 -1.055426
H  -4.789152 -0.798748 0.910621
H  -4.104296 0.758048 1.267407
H  -5.611837 0.894892 -0.697018
H  -3.96972 1.25831 -1.2200
H  -4.675089 -0.326131 -1.553209
H  3.383218 -1.437562 1.440022
H  3.600283 -0.244902 2.708949
H  2.033296 -0.053783 -2.855913
H  1.482063 1.617765 -2.909386
H  4.029799 1.522853 0.975303
H  3.892257 0.315367 -0.288113
H  6.277634 0.69774 0.269738
H  5.982442 0.272236 1.952644
H  5.827917 -0.950461 0.692351
H  -0.917697 0.801197 -2.887357
H  0.007292 0.26279 -4.287023
H  -0.321607 -0.866097 -2.981619
elementType: S P O N C H
totalener: -1541.03451443 hartree
nucrepener: 1917.10579433 hartree
electener: -3458.14030876 hartree
oneelecener: -5924.59340715 hartree
twoeener: 2466.45309839 hartree
cpcmener: -0.05206531 hartree
kineticenergy: 1535.94517267 hartree
xcener: -113.716943827129 hartree
chargesum: 0.0000000
charge: -0.183431 0.757880 -0.351439 -0.647140 -0.119625 -0.139769 -0.449624 -0.269472 -0.080055 -0.029487 0.369902 -0.053759 -0.246261 -0.083308 0.040552 -0.086608 -0.260991 -0.271599 0.012467 0.122239 0.123336 0.112782 0.108083 0.102128 0.104960 0.103016 0.082993 0.093684 0.113658 0.129809 0.101593 0.112473 0.065768 0.061833 0.093662 0.085980 0.085230 0.088918 0.108997 0.090624
qa: -0.1834 0.7579 -0.3514 -0.6471 -0.1196 -0.1398 -0.4496 -0.2695 -0.0801 -0.0295 0.3699 -0.0538 -0.2463 -0.0833 0.0406 -0.0866 -0.2610 -0.2716 0.0125 0.1222 0.1233 0.1128 0.1081 0.1021 0.1050 0.1030 0.0830 0.0937 0.1137 0.1298 0.1016 0.1125 0.0658 0.0618 0.0937 0.0860 0.0852 0.0889 0.1090 0.0906
va: 2.3070 5.4082 2.0596 1.9409 3.1741 3.3054 2.8943 3.1235 3.9201 3.9253 4.0977 3.8862 3.9096 3.8641 3.8327 3.8877 3.9378 3.9568 4.4196 1.0093 1.0077 1.0035 0.9978 0.9995 1.0079 1.0071 1.0076 1.0048 1.0277 1.0022 1.0049 0.9898 1.0156 1.0237 1.0033 1.0006 1.0007 1.0060 1.0095 1.0064
dispcorr: -0.020958274 hartree
energy: -1541.055472705988
dipole: 3.06283 -3.53155 -0.46873 -5.41730 2.03417 -3.38313 -9.98263 8.67691 -1.30572
magnitude: 3.65653 au
magnitude: 9.29415 debye
