program: Orca
programVersion: 5.0.4
elementType: S P O O N N N N C C C C C C C C C C C H H H H H H H H H H H H H H H H H H H H H
charge: 0
multiplicity: 1
keywords: wb97x-d3
keywords: def2-TZVPP
keywords: def2/J RIJCOSX
keywords: DEFGRID2
keywords: scfconv7
keywords: smallprint printgap noloewdin
keywords: NOSOSCF
formula: C11H21N4O2PS
InChI: InChI=1/C11H21N4O2PS/c1-4-9-19-18(16,17-6-3)15-8-7-14(5-2)11(15)13-10-12/h4-9H2,1-3H3
40 atoms
S  1.580477 -0.1977 1.616762
P  1.011626 -0.730306 -0.298771
O  1.286486 0.571404 -1.172369
O  1.62068 -1.983001 -0.81732
N  -0.669359 -0.926758 -0.200695
N  -2.743271 -0.574494 0.478415
N  -1.157918 1.233586 0.427351
N  -2.403089 3.207581 1.206622
C  -1.268352 -2.264689 -0.134105
C  -2.748913 -1.928388 -0.06309
C  -1.560747 0.007276 0.255889
C  -4.005584 0.129394 0.642113
C  -4.537503 0.724924 -0.648582
C  3.332388 -0.744642 1.587279
C  1.345571 0.507877 -2.619604
C  4.254703 0.091503 0.719276
C  0.029471 0.141445 -3.26063
C  4.271463 1.567326 1.075007
C  -1.885157 2.228806 0.845812
H  -1.021224 -2.856001 -1.010603
H  -0.931118 -2.79093 0.760487
H  -3.296839 -2.602721 0.591353
H  -3.217662 -1.942306 -1.049732
H  -4.71075 -0.599234 1.040432
H  -3.898743 0.891143 1.411544
H  -5.491703 1.214918 -0.455619
H  -3.859859 1.470483 -1.065716
H  -4.705784 -0.042603 -1.404076
H  3.361688 -1.797575 1.312254
H  3.627519 -0.676943 2.63591
H  2.132542 -0.187322 -2.914663
H  1.654622 1.507361 -2.91801
H  4.0044 -0.042401 -0.335529
H  5.256929 -0.327894 0.843184
H  3.309728 2.040757 0.876133
H  4.504284 1.716541 2.130827
H  5.024813 2.09676 0.491821
H  -0.777804 0.793329 -2.927453
H  0.128758 0.257545 -4.340309
H  -0.253364 -0.894049 -3.070373
elementType: S P O N C H
totalener: -1541.03396719 hartree
nucrepener: 1934.68089572 hartree
electener: -3475.71486291 hartree
oneelecener: -5959.86172557 hartree
twoeener: 2484.14686266 hartree
cpcmener: -0.05203021 hartree
kineticenergy: 1535.95001574 hartree
xcener: -113.719015333574 hartree
chargesum: -0.0000000
charge: -0.184295 0.764611 -0.350488 -0.647926 -0.123934 -0.137309 -0.450419 -0.269647 -0.076408 -0.029650 0.365483 -0.052642 -0.247002 -0.102675 0.040683 -0.103259 -0.260210 -0.261504 0.015174 0.121237 0.122875 0.112221 0.108120 0.101480 0.104889 0.102978 0.083330 0.093575 0.124170 0.130770 0.101548 0.111254 0.064124 0.085524 0.073006 0.087271 0.095139 0.088757 0.108435 0.090714
qa: -0.1843 0.7646 -0.3505 -0.6479 -0.1239 -0.1373 -0.4504 -0.2696 -0.0764 -0.0296 0.3655 -0.0526 -0.2470 -0.1027 0.0407 -0.1033 -0.2602 -0.2615 0.0152 0.1212 0.1229 0.1122 0.1081 0.1015 0.1049 0.1030 0.0833 0.0936 0.1242 0.1308 0.1015 0.1113 0.0641 0.0855 0.0730 0.0873 0.0951 0.0888 0.1084 0.0907
va: 2.2908 5.4041 2.0588 1.9426 3.1720 3.3058 2.8912 3.1239 3.9179 3.9275 4.1012 3.8849 3.9104 3.8750 3.8333 3.8698 3.9349 3.9348 4.4150 1.0097 1.0088 1.0035 0.9980 0.9999 1.0078 1.0068 1.0077 1.0048 1.0271 1.0009 1.0046 0.9896 1.0211 1.0077 1.0140 1.0003 1.0052 1.0065 1.0095 1.0076
dispcorr: -0.021436943 hartree
energy: -1541.055404131964
dipole: -0.05639 -0.66425 -0.72064 -1.47468 -1.81053 -3.28522 -9.16187 7.84543 -1.31644
magnitude: 3.61179 au
magnitude: 9.18043 debye
