program: Orca
programVersion: 5.0.4
elementType: S P O O N N N N C C C C C C C C C C C H H H H H H H H H H H H H H H H H H H H H
charge: 0
multiplicity: 1
keywords: wb97x-d3
keywords: def2-TZVPP
keywords: def2/J RIJCOSX
keywords: DEFGRID2
keywords: scfconv7
keywords: smallprint printgap noloewdin
keywords: NOSOSCF
formula: C11H21N4O2PS
InChI: InChI=1/C11H21N4O2PS/c1-4-9-19-18(16,17-6-3)15-8-7-14(5-2)11(15)13-10-12/h4-9H2,1-3H3
40 atoms
S  1.897113 0.811099 0.077936
P  0.992787 -0.69849 -1.016379
O  0.630764 -0.006274 -2.39841
O  1.777331 -1.958789 -1.065509
N  -0.536279 -1.022853 -0.378933
N  -2.447108 -0.687475 0.680515
N  -1.34692 1.131705 -0.447642
N  -2.732758 3.107281 0.033792
C  -0.942815 -2.35564 0.078906
C  -2.015222 -2.015428 1.099855
C  -1.482427 -0.095281 -0.034448
C  -3.456528 0.002766 1.467329
C  -2.916261 0.611457 2.749763
C  2.809655 -0.169268 1.329175
C  1.611067 0.671318 -3.220448
C  1.938129 -0.890346 2.342855
C  1.301302 2.145028 -3.2816
C  0.976478 0.011016 3.096773
C  -2.128523 2.128048 -0.144486
H  -1.340255 -2.932035 -0.756619
H  -0.115832 -2.903226 0.521035
H  -1.614449 -1.982051 2.116728
H  -2.846765 -2.716552 1.075731
H  -3.945973 0.753284 0.849977
H  -4.221484 -0.738228 1.697002
H  -2.171269 1.383377 2.55607
H  -3.734688 1.071134 3.303928
H  -2.465094 -0.144259 3.393151
H  3.430551 0.580459 1.823645
H  3.480263 -0.854672 0.813759
H  1.545894 0.214284 -4.206823
H  2.621003 0.497147 -2.843387
H  2.62103 -1.369678 3.049711
H  1.393129 -1.704476 1.860275
H  0.420206 -0.555936 3.843655
H  1.50792 0.810886 3.616044
H  0.250343 0.477666 2.430279
H  2.002312 2.628639 -3.962564
H  0.293163 2.325936 -3.654988
H  1.402069 2.622603 -2.306413
elementType: S P O N C H
totalener: -1541.03551371 hartree
nucrepener: 1969.17433587 hartree
electener: -3510.20984958 hartree
oneelecener: -6028.42662912 hartree
twoeener: 2518.21677954 hartree
cpcmener: -0.05176863 hartree
kineticenergy: 1535.94749521 hartree
xcener: -113.722369509507 hartree
chargesum: -0.0000000
charge: -0.197901 0.769217 -0.356926 -0.646896 -0.089089 -0.107572 -0.438892 -0.266648 -0.083683 -0.049025 0.308393 -0.039696 -0.272096 -0.082269 0.025404 -0.113718 -0.243725 -0.263472 0.019511 0.124210 0.127135 0.109669 0.119566 0.107013 0.102052 0.082431 0.109965 0.093978 0.129147 0.122611 0.109522 0.099467 0.090274 0.069781 0.098873 0.101856 0.056554 0.101533 0.092452 0.080994
qa: -0.1979 0.7692 -0.3569 -0.6469 -0.0891 -0.1076 -0.4389 -0.2666 -0.0837 -0.0490 0.3084 -0.0397 -0.2721 -0.0823 0.0254 -0.1137 -0.2437 -0.2635 0.0195 0.1242 0.1271 0.1097 0.1196 0.1070 0.1021 0.0824 0.1100 0.0940 0.1291 0.1226 0.1095 0.0995 0.0903 0.0698 0.0989 0.1019 0.0566 0.1015 0.0925 0.0810
va: 2.2770 5.4520 2.1195 1.9535 3.1074 3.2663 2.9138 3.1300 3.9095 3.9147 4.2018 3.8571 3.9213 3.8624 3.8638 3.8798 3.9253 3.9350 4.4038 1.0052 1.0026 0.9944 1.0062 1.0065 0.9997 1.0021 1.0109 1.0008 1.0026 1.0267 0.9989 1.0026 1.0106 1.0125 1.0043 1.0050 1.0006 1.0096 1.0033 1.0068
dispcorr: -0.023516649 hartree
energy: -1541.059030355056
dipole: -0.97738 1.32078 0.34340 -2.18431 -0.73680 -2.92112 15.42827 -13.65999 1.76827
magnitude: 3.43186 au
magnitude: 8.72309 debye
