program: Orca
programVersion: 5.0.4
elementType: S P O O N N N N C C C C C C C C C C C H H H H H H H H H H H H H H H H H H H H H
charge: 0
multiplicity: 1
keywords: wb97x-d3
keywords: def2-TZVPP
keywords: def2/J RIJCOSX
keywords: DEFGRID2
keywords: scfconv7
keywords: smallprint printgap noloewdin
keywords: NOSOSCF
formula: C11H21N4O2PS
InChI: InChI=1/C11H21N4O2PS/c1-4-9-19-18(16,17-6-3)15-8-7-14(5-2)11(15)13-10-12/h4-9H2,1-3H3
40 atoms
S  2.032961 0.887335 -0.006175
P  0.907369 -0.564764 -0.969054
O  0.286652 0.189105 -2.223408
O  1.657753 -1.819233 -1.231561
N  -0.487671 -0.919542 -0.073396
N  -2.26482 -0.625902 1.209511
N  -1.234456 1.248179 0.104353
N  -2.583969 3.19355 0.775186
C  -0.724936 -2.235443 0.527968
C  -2.141963 -2.07128 1.052653
C  -1.3740 -0.006356 0.422741
C  -3.558491 -0.076375 1.590101
C  -4.54052 0.022599 0.435956
C  3.255707 -0.155778 0.875615
C  0.957442 0.237259 -3.506098
C  2.712132 -0.920821 2.067929
C  1.966303 1.353919 -3.5933
C  2.06025 -0.046891 3.12474
C  -1.996821 2.225389 0.502375
H  -0.647131 -3.030905 -0.207025
H  -0.015873 -2.423254 1.334827
H  -2.292616 -2.577819 2.003366
H  -2.882736 -2.440538 0.339378
H  -3.952359 -0.73523 2.363217
H  -3.416593 0.890353 2.068871
H  -4.186528 0.691536 -0.348859
H  -4.733325 -0.95251 -0.011578
H  -5.490014 0.413821 0.800914
H  4.00897 0.566372 1.196674
H  3.732814 -0.817248 0.15511
H  0.15533 0.383624 -4.227026
H  1.419153 -0.728849 -3.714881
H  3.559948 -1.455956 2.504642
H  2.015608 -1.691785 1.731704
H  1.764532 -0.641978 3.988743
H  2.744341 0.728026 3.47475
H  1.164723 0.447935 2.74632
H  2.327393 1.414102 -4.620331
H  1.521108 2.315443 -3.338147
H  2.827082 1.185681 -2.947837
elementType: S P O N C H
totalener: -1541.03365995 hartree
nucrepener: 1939.35764708 hartree
electener: -3480.39130703 hartree
oneelecener: -5969.10465598 hartree
twoeener: 2488.71334895 hartree
cpcmener: -0.05047837 hartree
kineticenergy: 1535.95025247 hartree
xcener: -113.720882393700 hartree
chargesum: 0.0000000
charge: -0.183040 0.776065 -0.358753 -0.647527 -0.092132 -0.146432 -0.454105 -0.270583 -0.090574 -0.032495 0.368592 -0.053077 -0.249527 -0.093004 0.032508 -0.109255 -0.250740 -0.263740 0.015753 0.120253 0.132778 0.112168 0.109348 0.102092 0.104515 0.084180 0.093381 0.102573 0.129684 0.120797 0.109275 0.096540 0.087953 0.064658 0.095698 0.091275 0.071267 0.101143 0.090260 0.082228
qa: -0.1830 0.7761 -0.3588 -0.6475 -0.0921 -0.1464 -0.4541 -0.2706 -0.0906 -0.0325 0.3686 -0.0531 -0.2495 -0.0930 0.0325 -0.1093 -0.2507 -0.2637 0.0158 0.1203 0.1328 0.1122 0.1093 0.1021 0.1045 0.0842 0.0934 0.1026 0.1297 0.1208 0.1093 0.0965 0.0880 0.0647 0.0957 0.0913 0.0713 0.1011 0.0903 0.0822
va: 2.2784 5.4204 2.1312 1.9498 3.1535 3.2611 2.9086 3.1233 3.9354 3.9272 4.1277 3.8850 3.9124 3.8620 3.8669 3.8804 3.9026 3.9339 4.4133 1.0109 0.9910 1.0044 0.9985 0.9988 1.0080 1.0078 1.0050 1.0067 1.0023 1.0286 0.9902 1.0059 1.0099 1.0218 1.0050 1.0019 1.0101 1.0095 1.0039 1.0152
dispcorr: -0.021353379 hartree
energy: -1541.055013324732
dipole: -0.69263 0.85746 0.16483 -7.26820 3.65580 -3.61240 6.40259 -5.77644 0.62615
magnitude: 3.66997 au
magnitude: 9.32832 debye
