program: Orca
programVersion: 5.0.4
elementType: S P O O N N N N C C C C C C C C C C C H H H H H H H H H H H H H H H H H H H H H
charge: 0
multiplicity: 1
keywords: wb97x-d3
keywords: def2-TZVPP
keywords: def2/J RIJCOSX
keywords: DEFGRID2
keywords: scfconv7
keywords: smallprint printgap noloewdin
keywords: NOSOSCF
formula: C11H21N4O2PS
InChI: InChI=1/C11H21N4O2PS/c1-4-9-19-18(16,17-6-3)15-8-7-14(5-2)11(15)13-10-12/h4-9H2,1-3H3
40 atoms
S  2.016872 1.042556 0.629573
P  1.176792 -0.233504 -0.762201
O  0.94267 0.823949 -1.920732
O  1.950794 -1.457164 -1.088285
N  -0.34933 -0.740654 -0.210454
N  -2.375656 -0.6865 0.666915
N  -1.25716 1.354782 0.06217
N  -2.837195 3.156776 0.610525
C  -0.634032 -2.137158 0.129811
C  -2.134111 -2.094319 0.389641
C  -1.379467 0.067618 0.190798
C  -3.714313 -0.238432 1.005796
C  -4.631402 -0.085319 -0.194626
C  2.547234 -0.179106 1.892882
C  0.67248 0.437798 -3.287165
C  3.951077 -0.707067 1.665599
C  -0.722205 -0.102865 -3.484784
C  4.361495 -1.665487 2.773696
C  -2.140972 2.255599 0.376753
H  -0.377603 -2.807294 -0.685493
H  -0.078764 -2.435501 1.02021
H  -2.426199 -2.710435 1.238575
H  -2.707418 -2.415114 -0.48419
H  -4.120103 -0.980036 1.694859
H  -3.654593 0.690675 1.569474
H  -4.27506 0.679763 -0.884776
H  -4.736442 -1.020471 -0.745713
H  -5.625072 0.211255 0.142325
H  1.814298 -0.986063 1.95127
H  2.482979 0.362987 2.837799
H  1.425122 -0.280489 -3.616927
H  0.813182 1.353285 -3.859062
H  4.649653 0.131578 1.622551
H  4.004309 -1.209779 0.699016
H  3.694043 -2.527866 2.824281
H  5.371717 -2.041489 2.608702
H  4.347779 -1.178197 3.75037
H  -0.894857 -0.23309 -4.554076
H  -0.865492 -1.074188 -3.011088
H  -1.477509 0.588007 -3.109598
elementType: S P O N C H
totalener: -1541.04506847 hartree
nucrepener: 1919.74683403 hartree
electener: -3460.79190250 hartree
oneelecener: -5929.43908770 hartree
twoeener: 2468.64718519 hartree
cpcmener: -0.04579656 hartree
kineticenergy: 1535.94435374 hartree
xcener: -113.717731246722 hartree
chargesum: -0.0000000
charge: -0.169715 0.759219 -0.347379 -0.619957 -0.116637 -0.127594 -0.427751 -0.254440 -0.091334 -0.028265 0.345747 -0.061279 -0.238631 -0.094491 0.035697 -0.090463 -0.261195 -0.268869 0.001442 0.120387 0.123226 0.110817 0.104834 0.098257 0.106412 0.084572 0.088629 0.100293 0.107086 0.129640 0.099234 0.108397 0.064029 0.065525 0.082987 0.093958 0.082604 0.108864 0.087180 0.088960
qa: -0.1697 0.7592 -0.3474 -0.6200 -0.1166 -0.1276 -0.4278 -0.2544 -0.0913 -0.0283 0.3457 -0.0613 -0.2386 -0.0945 0.0357 -0.0905 -0.2612 -0.2689 0.0014 0.1204 0.1232 0.1108 0.1048 0.0983 0.1064 0.0846 0.0886 0.1003 0.1071 0.1296 0.0992 0.1084 0.0640 0.0655 0.0830 0.0940 0.0826 0.1089 0.0872 0.0890
va: 2.2886 5.4430 2.1180 1.9820 3.1026 3.2853 2.9079 3.1314 3.9366 3.9072 4.1313 3.8862 3.9074 3.8711 3.8638 3.8897 3.9279 3.9494 4.4112 1.0106 0.9988 1.0033 0.9972 0.9994 1.0077 1.0088 1.0048 1.0079 1.0155 1.0063 1.0024 0.9881 1.0140 1.0304 1.0016 1.0041 1.0009 1.0094 1.0037 1.0078
dispcorr: -0.021226334 hartree
energy: -1541.066294802286
dipole: -3.78154 3.04956 -0.73198 -15.83629 11.81652 -4.01977 2.63587 -2.41103 0.22485
magnitude: 4.09205 au
magnitude: 10.40117 debye
