program: Orca
programVersion: 5.0.4
elementType: S P O O N N N N C C C C C C C C C C C H H H H H H H H H H H H H H H H H H H H H
charge: 0
multiplicity: 1
keywords: wb97x-d3
keywords: def2-TZVPP
keywords: def2/J RIJCOSX
keywords: DEFGRID2
keywords: scfconv7
keywords: smallprint printgap noloewdin
keywords: NOSOSCF
formula: C11H21N4O2PS
InChI: InChI=1/C11H21N4O2PS/c1-4-9-19-18(16,17-6-3)15-8-7-14(5-2)11(15)13-10-12/h4-9H2,1-3H3
40 atoms
S  1.909448 1.15792 0.523925
P  1.106396 -0.220793 -0.799376
O  0.770013 0.749449 -2.00883
O  1.946692 -1.411766 -1.077534
N  -0.396478 -0.770078 -0.223767
N  -2.305082 -0.703737 0.883836
N  -1.281382 1.325439 0.090591
N  -2.831563 3.121947 0.739461
C  -0.599388 -2.14623 0.234439
C  -2.067027 -2.118825 0.640579
C  -1.384416 0.04115 0.268086
C  -3.584854 -0.255228 1.400557
C  -4.660717 -0.117073 0.337773
C  3.263383 0.168847 1.256923
C  0.108022 0.267595 -3.199717
C  2.80442 -0.840172 2.292224
C  1.11298 -0.005431 -4.289754
C  3.992058 -1.54451 2.931072
C  -2.142667 2.227253 0.463413
H  -0.402173 -2.861965 -0.558238
H  0.048121 -2.369579 1.08428
H  -2.259904 -2.701786 1.539547
H  -2.71818 -2.485565 -0.157272
H  -3.887063 -0.990671 2.146451
H  -3.449645 0.680146 1.940502
H  -5.600448 0.173936 0.80794
H  -4.409411 0.645648 -0.399252
H  -4.830896 -1.057533 -0.187465
H  3.906543 0.923741 1.714509
H  3.839114 -0.297902 0.458494
H  -0.584501 1.057212 -3.488729
H  -0.485054 -0.623342 -2.980129
H  2.148212 -1.578666 1.825416
H  2.212865 -0.333656 3.057948
H  4.586341 -2.07889 2.187907
H  4.65148 -0.836751 3.436624
H  3.661269 -2.272589 3.672596
H  1.789647 -0.816069 -4.019098
H  0.586439 -0.296781 -5.199415
H  1.704532 0.881667 -4.517434
elementType: S P O N C H
totalener: -1541.04726787 hartree
nucrepener: 1913.96344094 hartree
electener: -3455.01070881 hartree
oneelecener: -5917.99679899 hartree
twoeener: 2462.98609019 hartree
cpcmener: -0.04418930 hartree
kineticenergy: 1535.95850873 hartree
xcener: -113.717979146751 hartree
chargesum: -0.0000000
charge: -0.173018 0.779086 -0.348795 -0.621907 -0.142961 -0.128218 -0.456490 -0.251463 -0.091295 -0.028407 0.387325 -0.061646 -0.240504 -0.076289 0.034106 -0.095461 -0.244589 -0.269622 0.001767 0.118902 0.125579 0.110666 0.105024 0.098083 0.107088 0.100506 0.085237 0.088985 0.127233 0.108817 0.106140 0.091042 0.060515 0.066891 0.085134 0.086077 0.091726 0.081556 0.094014 0.089166
qa: -0.1730 0.7791 -0.3488 -0.6219 -0.1430 -0.1282 -0.4565 -0.2515 -0.0913 -0.0284 0.3873 -0.0616 -0.2405 -0.0763 0.0341 -0.0955 -0.2446 -0.2696 0.0018 0.1189 0.1256 0.1107 0.1050 0.0981 0.1071 0.1005 0.0852 0.0890 0.1272 0.1088 0.1061 0.0910 0.0605 0.0669 0.0851 0.0861 0.0917 0.0816 0.0940 0.0892
va: 2.3025 5.4228 2.1192 1.9781 3.1195 3.2946 2.8950 3.1287 3.9482 3.9152 4.0848 3.8822 3.9070 3.8396 3.8919 3.8954 3.9392 3.9573 4.4113 1.0106 0.9951 1.0027 0.9982 1.0000 1.0058 1.0073 1.0093 1.0047 1.0064 1.0289 0.9914 0.9974 1.0221 1.0149 1.0011 1.0013 1.0037 1.0158 1.0074 1.0038
dispcorr: -0.020380591 hartree
energy: -1541.067648456132
dipole: -0.94134 0.39648 -0.54486 -15.51089 11.52427 -3.98662 3.25384 -2.91216 0.34168
magnitude: 4.03816 au
magnitude: 10.26420 debye
