program: Orca
programVersion: 5.0.4
elementType: S P O O N N N N C C C C C C C C C C C H H H H H H H H H H H H H H H H H H H H H
charge: 0
multiplicity: 1
keywords: wb97x-d3
keywords: def2-TZVPP
keywords: def2/J RIJCOSX
keywords: DEFGRID2
keywords: scfconv7
keywords: smallprint printgap noloewdin
keywords: NOSOSCF
formula: C11H21N4O2PS
InChI: InChI=1/C11H21N4O2PS/c1-4-9-19-18(16,17-6-3)15-8-7-14(5-2)11(15)13-10-12/h4-9H2,1-3H3
40 atoms
S  1.486635 0.710286 1.03638
P  0.814224 -0.68256 -0.35892
O  0.605682 0.08129 -1.739354
O  1.627768 -1.923082 -0.392779
N  -0.792028 -1.049348 0.015002
N  -2.876588 -0.773665 0.671741
N  -1.468282 1.128543 0.212789
N  -2.908119 3.09949 0.51899
C  -1.236431 -2.400202 0.360678
C  -2.746181 -2.205888 0.441685
C  -1.763471 -0.135183 0.30779
C  -4.180661 -0.185627 0.91521
C  -4.993683 0.040379 -0.347112
C  3.095827 -0.020151 1.516739
C  1.718737 0.529037 -2.542826
C  4.212934 0.247528 0.525419
C  1.91295 2.020045 -2.43517
C  5.542431 -0.294587 1.028269
C  -2.280504 2.129217 0.396791
H  -0.953865 -3.121277 -0.401006
H  -0.81557 -2.710389 1.318253
H  -3.192341 -2.768016 1.260371
H  -3.244469 -2.491307 -0.488154
H  -4.705979 -0.868946 1.583282
H  -4.059877 0.742031 1.471524
H  -4.518605 0.7616 -1.012269
H  -5.146499 -0.887224 -0.899819
H  -5.976087 0.431609 -0.081162
H  2.96589 -1.084239 1.710232
H  3.312624 0.455129 2.476237
H  1.471205 0.243195 -3.565048
H  2.630778 -0.007702 -2.272308
H  4.292182 1.322652 0.349074
H  3.972928 -0.211868 -0.435671
H  5.499857 -1.374115 1.183564
H  6.3388 -0.097054 0.309712
H  5.831009 0.166679 1.974485
H  2.20602 2.322162 -1.430302
H  2.705504 2.322547 -3.121186
H  1.008215 2.562318 -2.711726
elementType: S P O N C H
totalener: -1541.04536804 hartree
nucrepener: 1904.69022053 hartree
electener: -3445.73558857 hartree
oneelecener: -5899.89918247 hartree
twoeener: 2454.16359389 hartree
cpcmener: -0.04160629 hartree
kineticenergy: 1535.96173059 hartree
xcener: -113.720604289865 hartree
chargesum: -0.0000000
charge: -0.190529 0.772036 -0.330427 -0.623879 -0.143804 -0.135837 -0.468485 -0.249580 -0.070158 -0.035109 0.388485 -0.062041 -0.237756 -0.059622 0.016658 -0.105931 -0.239400 -0.269921 0.006942 0.119183 0.114264 0.111010 0.105014 0.098791 0.106755 0.086011 0.088399 0.099417 0.107303 0.124133 0.113202 0.099814 0.067890 0.068775 0.085012 0.092705 0.085272 0.073480 0.096445 0.095483
qa: -0.1905 0.7720 -0.3304 -0.6239 -0.1438 -0.1358 -0.4685 -0.2496 -0.0702 -0.0351 0.3885 -0.0620 -0.2378 -0.0596 0.0167 -0.1059 -0.2394 -0.2699 0.0069 0.1192 0.1143 0.1110 0.1050 0.0988 0.1068 0.0860 0.0884 0.0994 0.1073 0.1241 0.1132 0.0998 0.0679 0.0688 0.0850 0.0927 0.0853 0.0735 0.0964 0.0955
va: 2.2894 5.4586 2.1176 1.9851 3.1837 3.2935 2.8902 3.1292 3.9375 3.9250 4.1167 3.8859 3.9074 3.8434 3.8818 3.9019 3.9212 3.9669 4.4066 1.0065 1.0031 1.0020 0.9971 0.9998 1.0061 1.0091 1.0046 1.0074 1.0322 1.0048 0.9943 0.9909 1.0112 1.0124 1.0010 1.0033 1.0011 1.0200 1.0095 1.0042
dispcorr: -0.020292543 hartree
energy: -1541.065660581001
dipole: 8.43056 -8.27467 0.15589 -3.34115 0.27841 -3.06274 -2.78063 2.77403 -0.00660
magnitude: 3.06671 au
magnitude: 7.79495 debye
