program: Orca
programVersion: 5.0.4
elementType: S P O O N N N N C C C C C C C C C C C H H H H H H H H H H H H H H H H H H H H H
charge: 0
multiplicity: 1
keywords: wb97x-d3
keywords: def2-TZVPP
keywords: def2/J RIJCOSX
keywords: DEFGRID2
keywords: scfconv7
keywords: smallprint printgap noloewdin
keywords: NOSOSCF
formula: C11H21N4O2PS
InChI: InChI=1/C11H21N4O2PS/c1-4-9-19-18(16,17-6-3)15-8-7-14(5-2)11(15)13-10-12/h4-9H2,1-3H3
40 atoms
S  1.605856 0.43071 1.046139
P  0.866794 -0.88555 -0.389511
O  0.779462 -0.074201 -1.755614
O  1.569224 -2.191926 -0.421643
N  -0.775985 -1.133538 -0.081299
N  -2.823599 -0.704003 0.611974
N  -1.281781 1.089353 0.14973
N  -2.577808 3.143426 0.54609
C  -1.320486 -2.448762 0.260563
C  -2.809343 -2.139163 0.364888
C  -1.671016 -0.149934 0.234115
C  -4.068811 -0.019509 0.906971
C  -4.883763 0.327331 -0.326618
C  3.088124 -0.478225 1.629108
C  1.901887 0.652523 -2.297042
C  4.301462 -0.370241 0.724087
C  1.619877 2.132587 -2.281246
C  4.793517 1.051341 0.513378
C  -2.018853 2.138461 0.378723
H  -1.10449 -3.181664 -0.511384
H  -0.913764 -2.800933 1.209712
H  -3.286744 -2.674097 1.184081
H  -3.340832 -2.37451 -0.560582
H  -4.637182 -0.686189 1.556225
H  -3.862044 0.869525 1.499776
H  -5.126057 -0.561198 -0.910603
H  -5.823317 0.789897 -0.023004
H  -4.362256 1.031729 -0.974615
H  2.815915 -1.51497 1.818264
H  3.293605 -0.021215 2.599903
H  2.038634 0.286765 -3.314603
H  2.818417 0.425301 -1.747394
H  4.091468 -0.847204 -0.235701
H  5.094111 -0.964395 1.18862
H  5.688222 1.063722 -0.109983
H  4.044063 1.673904 0.021627
H  5.046814 1.528662 1.462272
H  2.453851 2.66071 -2.745191
H  0.717574 2.374229 -2.843723
H  1.507099 2.509256 -1.264638
elementType: S P O N C H
totalener: -1541.04600115 hartree
nucrepener: 1923.42475629 hartree
electener: -3464.47075745 hartree
oneelecener: -5937.33377760 hartree
twoeener: 2472.86302015 hartree
cpcmener: -0.04129297 hartree
kineticenergy: 1535.96053556 hartree
xcener: -113.721943706668 hartree
chargesum: 0.0000000
charge: -0.197189 0.777231 -0.335571 -0.624493 -0.144520 -0.132829 -0.464322 -0.247280 -0.067956 -0.033873 0.383413 -0.060451 -0.239887 -0.074681 0.034342 -0.131964 -0.250558 -0.251571 0.008059 0.118232 0.113158 0.109946 0.104157 0.098194 0.107131 0.088936 0.100047 0.085339 0.118524 0.124513 0.110342 0.087623 0.070524 0.087049 0.094890 0.066380 0.090322 0.101055 0.098871 0.078869
qa: -0.1972 0.7772 -0.3356 -0.6245 -0.1445 -0.1328 -0.4643 -0.2473 -0.0680 -0.0339 0.3834 -0.0605 -0.2399 -0.0747 0.0343 -0.1320 -0.2506 -0.2516 0.0081 0.1182 0.1132 0.1099 0.1042 0.0982 0.1071 0.0889 0.1000 0.0853 0.1185 0.1245 0.1103 0.0876 0.0705 0.0870 0.0949 0.0664 0.0903 0.1011 0.0989 0.0789
va: 2.2689 5.4477 2.1124 1.9884 3.1776 3.2905 2.8933 3.1321 3.9371 3.9259 4.1264 3.8828 3.9075 3.8422 3.8864 3.9018 3.9120 3.9174 4.3984 1.0068 1.0038 1.0021 0.9974 1.0000 1.0055 1.0045 1.0072 1.0097 1.0322 1.0041 1.0009 0.9881 1.0165 1.0088 1.0045 1.0100 1.0024 1.0089 1.0057 1.0130
dispcorr: -0.021090110 hartree
energy: -1541.067091260780
dipole: 5.52361 -5.62574 -0.10213 0.88962 -3.71859 -2.82897 -2.38903 2.57825 0.18922
magnitude: 2.83713 au
magnitude: 7.21140 debye
