program: Orca
programVersion: 5.0.4
elementType: S P O O N N N N C C C C C C C C C C C H H H H H H H H H H H H H H H H H H H H H
charge: 0
multiplicity: 1
keywords: wb97x-d3
keywords: def2-TZVPP
keywords: def2/J RIJCOSX
keywords: DEFGRID2
keywords: scfconv7
keywords: smallprint printgap noloewdin
keywords: NOSOSCF
formula: C11H21N4O2PS
InChI: InChI=1/C11H21N4O2PS/c1-4-9-19-18(16,17-6-3)15-8-7-14(5-2)11(15)13-10-12/h4-9H2,1-3H3
40 atoms
S  1.881507 0.922384 0.213312
P  1.03912 -0.661253 -0.837968
O  0.66137 -0.055801 -2.256736
O  1.851846 -1.902095 -0.827225
N  -0.493525 -0.9903 -0.207404
N  -2.521562 -0.681546 0.598482
N  -1.278494 1.163877 -0.323994
N  -2.669369 3.146119 0.108872
C  -0.944075 -2.338724 0.137434
C  -2.185136 -2.047383 0.973702
C  -1.480677 -0.073863 0.024444
C  -3.712181 -0.052227 1.139706
C  -3.536385 0.472699 2.554295
C  3.231606 0.109983 1.153738
C  1.565909 0.710285 -3.079597
C  2.849596 -0.256839 2.576022
C  1.068402 2.127192 -3.20553
C  1.797343 -1.345546 2.689205
C  -2.063053 2.170328 -0.065315
H  -1.183548 -2.90059 -0.766111
H  -0.189324 -2.882262 0.698852
H  -1.981396 -2.110818 2.045682
H  -3.007268 -2.721907 0.739854
H  -4.041019 0.739876 0.469722
H  -4.497313 -0.808936 1.116546
H  -4.473372 0.910298 2.899704
H  -3.268099 -0.323615 3.249306
H  -2.769932 1.245921 2.608354
H  4.032946 0.849997 1.153384
H  3.590203 -0.750837 0.591417
H  1.589431 0.213377 -4.049373
H  2.579669 0.684468 -2.673663
H  2.520706 0.63912 3.107959
H  3.768166 -0.584784 3.071829
H  0.8370 -1.022399 2.284972
H  2.099916 -2.251617 2.162271
H  1.630496 -1.611473 3.733483
H  1.08542 2.649291 -2.248519
H  1.712789 2.673526 -3.895388
H  0.052651 2.159886 -3.600557
elementType: S P O N C H
totalener: -1541.04557246 hartree
nucrepener: 1946.37580847 hartree
electener: -3487.42138094 hartree
oneelecener: -5983.17209576 hartree
twoeener: 2495.75071482 hartree
cpcmener: -0.04088875 hartree
kineticenergy: 1535.95360532 hartree
xcener: -113.722383944706 hartree
chargesum: 0.0000000
charge: -0.200433 0.758748 -0.347795 -0.617116 -0.109249 -0.127368 -0.453916 -0.248834 -0.096681 -0.027527 0.362067 -0.060828 -0.241985 -0.078373 0.025740 -0.087147 -0.240833 -0.257016 0.010346 0.124155 0.126705 0.103683 0.113905 0.108062 0.098024 0.100141 0.089459 0.084972 0.126317 0.111728 0.107597 0.092929 0.066327 0.075160 0.053157 0.085778 0.100009 0.079473 0.099209 0.091407
qa: -0.2004 0.7587 -0.3478 -0.6171 -0.1092 -0.1274 -0.4539 -0.2488 -0.0967 -0.0275 0.3621 -0.0608 -0.2420 -0.0784 0.0257 -0.0871 -0.2408 -0.2570 0.0103 0.1242 0.1267 0.1037 0.1139 0.1081 0.0980 0.1001 0.0895 0.0850 0.1263 0.1117 0.1076 0.0929 0.0663 0.0752 0.0532 0.0858 0.1000 0.0795 0.0992 0.0914
va: 2.2776 5.4624 2.1280 1.9919 3.1118 3.2906 2.9096 3.1337 3.9304 3.9035 4.1483 3.8822 3.9072 3.8508 3.8743 3.8858 3.9207 3.9344 4.3964 1.0054 1.0007 0.9977 1.0031 1.0048 1.0002 1.0071 1.0043 1.0099 1.0054 1.0352 0.9984 1.0029 1.0121 1.0095 1.0093 1.0083 1.0090 1.0089 1.0105 1.0044
dispcorr: -0.021876585 hartree
energy: -1541.067449048875
dipole: -0.55080 0.74157 0.19078 -4.52872 1.71327 -2.81545 12.26350 -11.14719 1.11631
magnitude: 3.03469 au
magnitude: 7.71356 debye
