program: Orca
programVersion: 5.0.4
elementType: S P O O N N N N C C C C C C C C C C C H H H H H H H H H H H H H H H H H H H H H
charge: 0
multiplicity: 1
keywords: wb97x-d3
keywords: def2-TZVPP
keywords: def2/J RIJCOSX
keywords: DEFGRID2
keywords: scfconv7
keywords: smallprint printgap noloewdin
keywords: NOSOSCF
formula: C11H21N4O2PS
InChI: InChI=1/C11H21N4O2PS/c1-4-9-19-18(16,17-6-3)15-8-7-14(5-2)11(15)13-10-12/h4-9H2,1-3H3
40 atoms
S  1.782016 1.089419 0.085613
P  0.954043 -0.479657 -0.990649
O  0.46672 0.18332 -2.351829
O  1.831464 -1.671295 -1.093452
N  -0.505603 -0.923579 -0.261622
N  -2.494158 -0.788989 0.679664
N  -1.452073 1.167285 -0.258468
N  -2.966388 3.03148 0.270347
C  -0.839904 -2.313173 0.054679
C  -2.043645 -2.141236 0.975051
C  -1.536934 -0.089251 0.065105
C  -3.675769 -0.25699 1.333115
C  -3.418627 0.236789 2.746124
C  2.895177 0.170839 1.209628
C  1.32702 0.333549 -3.503914
C  2.182669 -0.588667 2.313303
C  2.18326 1.574036 -3.438462
C  3.185085 -1.239147 3.255749
C  -2.295567 2.106733 0.055145
H  -1.09444 -2.859446 -0.854237
H  -0.015894 -2.820223 0.549385
H  -1.767922 -2.23205 2.028739
H  -2.831071 -2.862418 0.76145
H  -4.105949 0.53107 0.718071
H  -4.410989 -1.062531 1.345561
H  -4.351101 0.594142 3.183788
H  -3.036225 -0.558171 3.387259
H  -2.706015 1.061788 2.76433
H  3.530182 0.953108 1.631137
H  3.537978 -0.478739 0.616621
H  0.642801 0.384308 -4.349619
H  1.938173 -0.562344 -3.62635
H  1.537273 -1.358316 1.883129
H  1.533084 0.093727 2.865856
H  3.829925 -0.496131 3.728621
H  2.675837 -1.786254 4.049781
H  3.826463 -1.947284 2.728098
H  2.682724 1.702921 -4.399667
H  1.583452 2.465423 -3.252751
H  2.95301 1.507798 -2.670976
elementType: S P O N C H
totalener: -1541.04538887 hartree
nucrepener: 1923.32690757 hartree
electener: -3464.37229644 hartree
oneelecener: -5936.95825093 hartree
twoeener: 2472.58595449 hartree
cpcmener: -0.04258517 hartree
kineticenergy: 1535.95728197 hartree
xcener: -113.721203357139 hartree
chargesum: -0.0000000
charge: -0.178437 0.743491 -0.348927 -0.621094 -0.100606 -0.135123 -0.449625 -0.254470 -0.090817 -0.023000 0.367958 -0.061997 -0.240832 -0.073729 0.031576 -0.088869 -0.253313 -0.270733 0.005202 0.124006 0.121863 0.101976 0.111808 0.107814 0.098080 0.100239 0.088953 0.085097 0.126558 0.109861 0.107099 0.094726 0.059417 0.067524 0.086138 0.092307 0.085607 0.099234 0.091934 0.083104
qa: -0.1784 0.7435 -0.3489 -0.6211 -0.1006 -0.1351 -0.4496 -0.2545 -0.0908 -0.0230 0.3680 -0.0620 -0.2408 -0.0737 0.0316 -0.0889 -0.2533 -0.2707 0.0052 0.1240 0.1219 0.1020 0.1118 0.1078 0.0981 0.1002 0.0890 0.0851 0.1266 0.1099 0.1071 0.0947 0.0594 0.0675 0.0861 0.0923 0.0856 0.0992 0.0919 0.0831
va: 2.2904 5.4532 2.1354 1.9817 3.1077 3.2885 2.9158 3.1264 3.9306 3.9092 4.1403 3.8849 3.9083 3.8457 3.8711 3.9060 3.9010 3.9620 4.4126 1.0051 1.0012 0.9978 1.0020 1.0059 0.9999 1.0073 1.0046 1.0095 1.0036 1.0298 0.9896 1.0056 1.0102 1.0159 1.0014 1.0036 1.0007 1.0098 1.0037 1.0160
dispcorr: -0.020571598 hartree
energy: -1541.065960470796
dipole: 4.60608 -4.18679 0.41929 -8.41629 5.03609 -3.38020 13.29899 -12.29727 1.00172
magnitude: 3.55035 au
magnitude: 9.02427 debye
