program: Orca
programVersion: 5.0.4
elementType: S P O O N N N N C C C C C C C C C C C H H H H H H H H H H H H H H H H H H H H H
charge: 0
multiplicity: 1
keywords: wb97x-d3
keywords: def2-TZVPP
keywords: def2/J RIJCOSX
keywords: DEFGRID2
keywords: scfconv7
keywords: smallprint printgap noloewdin
keywords: NOSOSCF
formula: C11H21N4O2PS
InChI: InChI=1/C11H21N4O2PS/c1-4-9-19-18(16,17-6-3)15-8-7-14(5-2)11(15)13-10-12/h4-9H2,1-3H3
40 atoms
S  1.856238 0.930051 0.21016
P  1.016821 -0.645257 -0.854143
O  0.646761 -0.024381 -2.269274
O  1.830515 -1.885687 -0.850325
N  -0.516935 -0.980365 -0.234065
N  -2.514833 -0.668816 0.642836
N  -1.30383 1.174346 -0.325713
N  -2.68652 3.15721 0.130861
C  -0.959701 -2.327465 0.126216
C  -2.160485 -2.030725 1.015698
C  -1.494911 -0.0624 0.030154
C  -3.676601 -0.033069 1.236104
C  -3.434049 0.491667 2.640763
C  3.163191 0.101363 1.194756
C  1.574269 0.719236 -3.086864
C  2.740208 -0.220004 2.616571
C  1.108735 2.146403 -3.220012
C  1.637626 -1.257419 2.730789
C  -2.080736 2.182093 -0.051377
H  -1.242252 -2.883169 -0.768783
H  -0.184695 -2.878501 0.651255
H  -1.906069 -2.082922 2.077509
H  -2.991292 -2.708682 0.827223
H  -4.0300 0.76058 0.580836
H  -4.466378 -0.784915 1.248819
H  -3.133667 -0.304722 3.322434
H  -2.665053 1.264137 2.659224
H  -4.353384 0.929852 3.029766
H  3.988776 0.813851 1.194098
H  3.503602 -0.784196 0.660232
H  1.595507 0.219887 -4.055389
H  2.584049 0.673359 -2.672867
H  2.443231 0.699517 3.126429
H  3.634448 -0.579492 3.134315
H  0.699352 -0.897297 2.306887
H  1.905116 -2.18522 2.222538
H  1.443383 -1.498013 3.776567
H  1.772724 2.677833 -3.902857
H  0.0985 2.200906 -3.626521
H  1.126224 2.669326 -2.263457
elementType: S P O N C H
totalener: -1541.04534074 hartree
nucrepener: 1949.24858686 hartree
electener: -3490.29392760 hartree
oneelecener: -5988.86106292 hartree
twoeener: 2498.56713532 hartree
cpcmener: -0.04098744 hartree
kineticenergy: 1535.96039002 hartree
xcener: -113.723647492921 hartree
chargesum: -0.0000000
charge: -0.200627 0.758126 -0.347258 -0.617977 -0.107501 -0.123678 -0.452204 -0.249505 -0.097043 -0.033614 0.356566 -0.059913 -0.243082 -0.079790 0.025452 -0.087547 -0.240363 -0.253347 0.011394 0.123889 0.127856 0.104936 0.115613 0.108296 0.097964 0.089614 0.085526 0.100396 0.126381 0.112223 0.107412 0.093097 0.067370 0.075116 0.051486 0.084226 0.100494 0.098646 0.091772 0.079599
qa: -0.2006 0.7581 -0.3473 -0.6180 -0.1075 -0.1237 -0.4522 -0.2495 -0.0970 -0.0336 0.3566 -0.0599 -0.2431 -0.0798 0.0255 -0.0875 -0.2404 -0.2533 0.0114 0.1239 0.1279 0.1049 0.1156 0.1083 0.0980 0.0896 0.0855 0.1004 0.1264 0.1122 0.1074 0.0931 0.0674 0.0751 0.0515 0.0842 0.1005 0.0986 0.0918 0.0796
va: 2.2783 5.4650 2.1274 1.9921 3.1081 3.2869 2.9122 3.1327 3.9273 3.9041 4.1547 3.8815 3.9072 3.8525 3.8742 3.8856 3.9218 3.9355 4.3960 1.0051 1.0012 0.9972 1.0039 1.0054 1.0002 1.0043 1.0095 1.0074 1.0056 1.0357 0.9986 1.0030 1.0120 1.0096 1.0079 1.0073 1.0088 1.0103 1.0042 1.0089
dispcorr: -0.022041190 hartree
energy: -1541.067381930881
dipole: -0.45509 0.68304 0.22796 -4.38724 1.56016 -2.82708 12.79427 -11.58991 1.20436
magnitude: 3.08136 au
magnitude: 7.83220 debye
