program: Orca
programVersion: 5.0.4
elementType: S P O O N N N N C C C C C C C C C C C H H H H H H H H H H H H H H H H H H H H H
charge: 0
multiplicity: 1
keywords: wb97x-d3
keywords: def2-TZVPP
keywords: def2/J RIJCOSX
keywords: DEFGRID2
keywords: scfconv7
keywords: smallprint printgap noloewdin
keywords: NOSOSCF
formula: C11H21N4O2PS
InChI: InChI=1/C11H21N4O2PS/c1-4-9-19-18(16,17-6-3)15-8-7-14(5-2)11(15)13-10-12/h4-9H2,1-3H3
40 atoms
S  1.507777 0.193381 1.626969
P  0.986193 -0.547641 -0.23615
O  1.155245 0.709703 -1.198826
O  1.702558 -1.782041 -0.643882
N  -0.673535 -0.882882 -0.142351
N  -2.800478 -0.653699 0.395521
N  -1.318851 1.243142 0.432865
N  -2.741381 3.174695 0.977915
C  -1.177748 -2.256231 -0.06941
C  -2.683332 -2.025785 -0.076865
C  -1.645672 -0.002071 0.249768
C  -4.109966 -0.059992 0.594657
C  -4.749244 0.435923 -0.690209
C  3.264511 -0.32747 1.682848
C  1.296822 0.564394 -2.630521
C  4.18073 0.486791 0.787952
C  -0.004669 0.248625 -3.324686
C  5.632489 0.067701 0.966536
C  -2.124875 2.221801 0.726618
H  -0.84705 -2.848543 -0.917471
H  -0.846564 -2.738392 0.852091
H  -3.209811 -2.706761 0.589658
H  -3.106046 -2.125105 -1.079824
H  -4.730789 -0.830457 1.05275
H  -4.037677 0.741382 1.327506
H  -5.74525 0.824341 -0.476299
H  -4.17143 1.239766 -1.146533
H  -4.856114 -0.365824 -1.421495
H  3.32352 -1.393744 1.466274
H  3.534855 -0.197785 2.732823
H  2.052573 -0.192096 -2.848901
H  1.685948 1.525266 -2.963674
H  4.065403 1.547683 1.019381
H  3.894429 0.361228 -0.258612
H  6.288923 0.664548 0.332409
H  5.963126 0.198892 1.998414
H  5.781487 -0.980074 0.699921
H  -0.768417 0.995283 -3.107597
H  0.166493 0.253961 -4.402191
H  -0.389484 -0.736848 -3.060871
elementType: S P O N C H
totalener: -1541.04597740 hartree
nucrepener: 1912.40726376 hartree
electener: -3453.45324116 hartree
oneelecener: -5915.19728541 hartree
twoeener: 2461.74404425 hartree
cpcmener: -0.04339763 hartree
kineticenergy: 1535.95115856 hartree
xcener: -113.716763704797 hartree
chargesum: 0.0000000
charge: -0.184228 0.743884 -0.342277 -0.621370 -0.128929 -0.130778 -0.450753 -0.251226 -0.081434 -0.029706 0.375394 -0.060654 -0.239834 -0.082724 0.043657 -0.086359 -0.259623 -0.270748 0.001715 0.120513 0.120251 0.111366 0.103998 0.098674 0.106843 0.100972 0.085401 0.089136 0.111889 0.127605 0.096441 0.109965 0.065585 0.061770 0.092904 0.084319 0.085164 0.090752 0.105426 0.087017
qa: -0.1842 0.7439 -0.3423 -0.6214 -0.1289 -0.1308 -0.4508 -0.2512 -0.0814 -0.0297 0.3754 -0.0607 -0.2398 -0.0827 0.0437 -0.0864 -0.2596 -0.2707 0.0017 0.1205 0.1203 0.1114 0.1040 0.0987 0.1068 0.1010 0.0854 0.0891 0.1119 0.1276 0.0964 0.1100 0.0656 0.0618 0.0929 0.0843 0.0852 0.0908 0.1054 0.0870
va: 2.3014 5.4391 2.0723 1.9792 3.1607 3.3064 2.8950 3.1266 3.9289 3.9217 4.0901 3.8854 3.9066 3.8640 3.8404 3.8912 3.9401 3.9568 4.4168 1.0091 1.0079 1.0024 0.9973 1.0001 1.0069 1.0073 1.0090 1.0047 1.0296 1.0027 1.0070 0.9896 1.0157 1.0219 1.0036 1.0008 1.0008 1.0055 1.0099 1.0063
dispcorr: -0.020604554 hartree
energy: -1541.066581953553
dipole: 3.01729 -3.47085 -0.45356 -5.72892 2.40246 -3.32646 -9.34011 8.16477 -1.17535
magnitude: 3.55703 au
magnitude: 9.04126 debye
