program: Orca
programVersion: 5.0.4
elementType: S P O O N N N N C C C C C C C C C C C H H H H H H H H H H H H H H H H H H H H H
charge: 0
multiplicity: 1
keywords: wb97x-d3
keywords: def2-TZVPP
keywords: def2/J RIJCOSX
keywords: DEFGRID2
keywords: scfconv7
keywords: smallprint printgap noloewdin
keywords: NOSOSCF
formula: C11H21N4O2PS
InChI: InChI=1/C11H21N4O2PS/c1-4-9-19-18(16,17-6-3)15-8-7-14(5-2)11(15)13-10-12/h4-9H2,1-3H3
40 atoms
S  1.75719 0.97889 0.359861
P  0.938587 -0.590418 -0.740495
O  0.500057 -0.010268 -2.149703
O  1.795462 -1.799069 -0.79981
N  -0.549464 -1.016982 -0.047668
N  -2.471119 -0.711337 0.989532
N  -1.357666 1.122989 -0.111087
N  -2.825144 3.066642 0.240426
C  -0.780712 -2.279552 0.651884
C  -2.255696 -2.152375 1.016581
C  -1.516968 -0.111113 0.276685
C  -3.757885 -0.151825 1.363104
C  -4.781134 -0.168391 0.241366
C  3.300156 0.203406 0.97048
C  0.724859 1.306144 -2.688654
C  3.097481 -0.667615 2.195489
C  -0.244732 1.516602 -3.821534
C  4.425869 -1.188099 2.723672
C  -2.177493 2.110427 0.111339
H  -0.585942 -3.133406 0.009436
H  -0.149212 -2.351059 1.53965
H  -2.475604 -2.554596 2.003893
H  -2.899976 -2.649442 0.28686
H  -4.115253 -0.743093 2.206543
H  -3.616519 0.857754 1.744653
H  -4.96651 -1.18051 -0.119855
H  -5.727268 0.231733 0.60662
H  -4.467542 0.443812 -0.604359
H  3.935456 1.059791 1.206781
H  3.782729 -0.336383 0.157147
H  1.758292 1.373339 -3.032649
H  0.572745 2.059187 -1.916102
H  2.444183 -1.507169 1.948739
H  2.589859 -0.090241 2.971391
H  5.090901 -0.370573 3.008298
H  4.276119 -1.811102 3.606202
H  4.944096 -1.793413 1.977924
H  -0.084816 2.507945 -4.246421
H  -0.106546 0.784928 -4.617829
H  -1.27671 1.465363 -3.472932
elementType: S P O N C H
totalener: -1541.04522778 hartree
nucrepener: 1914.30120018 hartree
electener: -3455.34642796 hartree
oneelecener: -5918.86613140 hartree
twoeener: 2463.51970344 hartree
cpcmener: -0.03971500 hartree
kineticenergy: 1535.95630232 hartree
xcener: -113.720762199754 hartree
chargesum: 0.0000000
charge: -0.202702 0.773207 -0.351128 -0.623091 -0.125961 -0.133006 -0.470164 -0.245410 -0.074149 -0.031987 0.382026 -0.060230 -0.240242 -0.058710 0.017144 -0.091082 -0.242135 -0.273006 0.009321 0.117434 0.115965 0.110707 0.105313 0.098173 0.108366 0.089231 0.100108 0.085675 0.125695 0.106979 0.120984 0.104498 0.060143 0.065092 0.084345 0.092058 0.085528 0.090024 0.091600 0.083386
qa: -0.2027 0.7732 -0.3511 -0.6231 -0.1260 -0.1330 -0.4702 -0.2454 -0.0741 -0.0320 0.3820 -0.0602 -0.2402 -0.0587 0.0171 -0.0911 -0.2421 -0.2730 0.0093 0.1174 0.1160 0.1107 0.1053 0.0982 0.1084 0.0892 0.1001 0.0857 0.1257 0.1070 0.1210 0.1045 0.0601 0.0651 0.0843 0.0921 0.0855 0.0900 0.0916 0.0834
va: 2.2811 5.4537 2.1177 1.9877 3.1360 3.2915 2.8788 3.1363 3.9409 3.9231 4.1219 3.8821 3.9093 3.8360 3.8481 3.8950 3.9510 3.9590 4.3876 1.0087 0.9988 1.0021 0.9977 0.9999 1.0055 1.0047 1.0073 1.0087 1.0059 1.0315 0.9947 0.9884 1.0231 1.0137 1.0009 1.0039 1.0007 1.0066 1.0035 1.0082
dispcorr: -0.020151617 hartree
energy: -1541.065379397773
dipole: -0.20527 0.03071 -0.17457 -6.26659 3.77940 -2.48719 5.66090 -4.47681 1.18409
magnitude: 2.76019 au
magnitude: 7.01585 debye
