program: Orca
programVersion: 5.0.4
elementType: S P O O N N N N C C C C C C C C C C C H H H H H H H H H H H H H H H H H H H H H
charge: 0
multiplicity: 1
keywords: wb97x-d3
keywords: def2-TZVPP
keywords: def2/J RIJCOSX
keywords: DEFGRID2
keywords: scfconv7
keywords: smallprint printgap noloewdin
keywords: NOSOSCF
formula: C11H21N4O2PS
InChI: InChI=1/C11H21N4O2PS/c1-4-9-19-18(16,17-6-3)15-8-7-14(5-2)11(15)13-10-12/h4-9H2,1-3H3
40 atoms
S  1.95672 0.840884 0.225092
P  1.078658 -0.640249 -0.932467
O  0.744182 0.098711 -2.301315
O  1.835449 -1.907913 -0.984423
N  -0.470703 -0.94529 -0.323468
N  -2.45481 -0.65113 0.605597
N  -1.194498 1.232195 -0.222454
N  -2.606835 3.167531 0.375929
C  -0.978832 -2.293909 -0.114933
C  -2.118533 -2.038199 0.86376
C  -1.411392 -0.010893 0.02839
C  -3.522549 -0.019225 1.357667
C  -3.117846 0.38797 2.766538
C  2.906871 -0.210186 1.381577
C  1.79065 0.610608 -3.139466
C  2.054895 -0.983881 2.375732
C  1.21247 0.878308 -4.50747
C  1.112865 -0.123619 3.201959
C  -1.981894 2.224688 0.12111
H  -1.340327 -2.718289 -1.054186
H  -0.212805 -2.953555 0.283967
H  -1.799164 -2.182233 1.902326
H  -2.975582 -2.686773 0.680429
H  -3.891773 0.843285 0.807397
H  -4.345463 -0.735776 1.389943
H  -2.760638 -0.460681 3.351008
H  -2.338344 1.148688 2.750556
H  -3.974694 0.811454 3.289318
H  3.551201 0.501737 1.901503
H  3.545664 -0.878034 0.806754
H  2.608914 -0.111554 -3.201407
H  2.185331 1.528239 -2.697715
H  2.742457 -1.517666 3.038297
H  1.497847 -1.759399 1.84563
H  1.656575 0.642655 3.756665
H  0.381658 0.387933 2.575839
H  0.569154 -0.728692 3.927657
H  1.985819 1.290725 -5.15541
H  0.840642 -0.036397 -4.967249
H  0.39621 1.597797 -4.4571
totalener: -1541.01000369 hartree
nucrepener: 1950.45214381 hartree
electener: -3491.46214750 hartree
oneelecener: -5990.95478984 hartree
twoeener: 2499.49264233 hartree
kineticenergy: 1536.02530842 hartree
xcener: -113.725611104089 hartree
chargesum: 0.0000000
charge: -0.162587 0.697783 -0.314058 -0.522974 -0.100122 -0.128544 -0.388113 -0.124239 -0.100113 -0.055556 0.285885 -0.076208 -0.227337 -0.103437 0.007920 -0.124064 -0.237496 -0.245479 -0.038952 0.109104 0.121411 0.087987 0.100010 0.118822 0.078999 0.071546 0.092876 0.097563 0.113810 0.125660 0.099521 0.094177 0.080668 0.063313 0.089744 0.073202 0.084577 0.076559 0.083671 0.094472
qa: -0.1626 0.6978 -0.3141 -0.5230 -0.1001 -0.1285 -0.3881 -0.1242 -0.1001 -0.0556 0.2859 -0.0762 -0.2273 -0.1034 0.0079 -0.1241 -0.2375 -0.2455 -0.0390 0.1091 0.1214 0.0880 0.1000 0.1188 0.0790 0.0715 0.0929 0.0976 0.1138 0.1257 0.0995 0.0942 0.0807 0.0633 0.0897 0.0732 0.0846 0.0766 0.0837 0.0945
va: 2.2813 5.5030 2.1617 2.0933 3.0745 3.2004 2.9249 3.1305 3.9426 3.9151 4.1804 3.9094 3.9051 3.8850 3.8920 3.8835 3.9739 3.9288 4.3426 1.0060 1.0066 0.9955 1.0051 1.0124 0.9981 1.0030 1.0132 1.0160 1.0039 1.0275 0.9920 0.9930 1.0115 1.0186 1.0082 1.0063 1.0055 1.0081 1.0065 1.0038
dispcorr: -0.022143193 hartree
energy: -1541.032146881376
dipole: -2.14847 2.33942 0.19095 -6.39117 4.28016 -2.11102 11.21069 -10.65100 0.55969
magnitude: 2.19228 au
magnitude: 5.57234 debye
