program: Orca
programVersion: 5.0.4
elementType: S P O O N N N N C C C C C C C C C C C H H H H H H H H H H H H H H H H H H H H H
charge: 0
multiplicity: 1
keywords: wb97x-d3
keywords: def2-TZVPP
keywords: def2/J RIJCOSX
keywords: DEFGRID2
keywords: scfconv7
keywords: smallprint printgap noloewdin
keywords: NOSOSCF
formula: C11H21N4O2PS
InChI: InChI=1/C11H21N4O2PS/c1-4-9-19-18(16,17-6-3)15-8-7-14(5-2)11(15)13-10-12/h4-9H2,1-3H3
40 atoms
S  2.029898 0.651733 0.171285
P  1.158115 -0.913033 -0.893622
O  0.84789 -0.302107 -2.325952
O  1.893533 -2.191728 -0.821883
N  -0.410872 -1.137796 -0.296502
N  -2.413953 -0.690103 0.520057
N  -1.046124 1.062255 -0.420116
N  -2.391794 3.096361 -0.034066
C  -0.955555 -2.442041 0.049459
C  -2.137935 -2.053587 0.932405
C  -1.326482 -0.145604 -0.069675
C  -3.5072 0.042713 1.130144
C  -3.186223 0.585466 2.514652
C  3.286364 -0.243299 1.158107
C  1.76499 0.492293 -3.088842
C  2.852374 -0.48609 2.594769
C  1.262275 1.912754 -3.184155
C  1.641791 -1.394999 2.732915
C  -1.800795 2.111487 -0.190716
H  -1.278231 -2.974403 -0.847673
H  -0.222971 -3.055782 0.566749
H  -1.879657 -2.099608 1.996323
H  -3.005933 -2.692509 0.767523
H  -3.812514 0.851971 0.470365
H  -4.353064 -0.645712 1.178584
H  -2.381075 1.317872 2.476849
H  -4.061854 1.086976 2.925517
H  -2.903041 -0.2063 3.209177
H  4.170878 0.393724 1.127856
H  3.533621 -1.174757 0.650528
H  1.827676 0.027082 -4.073056
H  2.764688 0.464645 -2.648098
H  2.656861 0.469905 3.085706
H  3.705089 -0.929401 3.117556
H  0.748632 -0.921457 2.323061
H  1.795317 -2.339606 2.209156
H  1.44213 -1.618196 3.780705
H  1.924491 2.492613 -3.827846
H  0.259457 1.949434 -3.607202
H  1.23437 2.390735 -2.206038
totalener: -1541.00973674 hartree
nucrepener: 1956.76924131 hartree
electener: -3497.77897805 hartree
oneelecener: -6003.68533602 hartree
twoeener: 2505.90635797 hartree
kineticenergy: 1536.02128006 hartree
xcener: -113.727833271952 hartree
chargesum: 0.0000000
charge: -0.183067 0.714369 -0.314573 -0.523445 -0.119561 -0.139887 -0.415227 -0.120325 -0.104202 -0.061911 0.330651 -0.079838 -0.222352 -0.103357 0.006260 -0.091078 -0.216911 -0.258000 -0.038038 0.112123 0.125405 0.092113 0.100465 0.117675 0.079830 0.098959 0.093735 0.070661 0.114266 0.118007 0.096984 0.081938 0.068441 0.069415 0.058159 0.085860 0.095453 0.084611 0.089886 0.086508
qa: -0.1831 0.7144 -0.3146 -0.5234 -0.1196 -0.1399 -0.4152 -0.1203 -0.1042 -0.0619 0.3307 -0.0798 -0.2224 -0.1034 0.0063 -0.0911 -0.2169 -0.2580 -0.0380 0.1121 0.1254 0.0921 0.1005 0.1177 0.0798 0.0990 0.0937 0.0707 0.1143 0.1180 0.0970 0.0819 0.0684 0.0694 0.0582 0.0859 0.0955 0.0846 0.0899 0.0865
va: 2.2786 5.4950 2.1506 2.0985 3.0930 3.2122 2.9312 3.1381 3.9418 3.9167 4.1562 3.9174 3.9012 3.8758 3.9091 3.8885 3.9122 3.9339 4.3342 1.0055 1.0035 0.9942 1.0054 1.0101 0.9978 1.0136 1.0133 1.0047 1.0063 1.0369 0.9973 1.0064 1.0125 1.0109 1.0084 1.0087 1.0105 1.0119 1.0080 1.0106
dispcorr: -0.022271615 hartree
energy: -1541.032008355951
dipole: -1.15826 1.26689 0.10862 -3.43385 1.61131 -1.82254 13.13297 -12.33823 0.79474
magnitude: 1.99124 au
magnitude: 5.06134 debye
