program: Orca
programVersion: 5.0.4
elementType: S P O O N N N N C C C C C C C C C C C H H H H H H H H H H H H H H H H H H H H H
charge: 0
multiplicity: 1
keywords: wb97x-d3
keywords: def2-TZVPP
keywords: def2/J RIJCOSX
keywords: DEFGRID2
keywords: scfconv7
keywords: smallprint printgap noloewdin
keywords: NOSOSCF
formula: C11H21N4O2PS
InChI: InChI=1/C11H21N4O2PS/c1-4-9-19-18(16,17-6-3)15-8-7-14(5-2)11(15)13-10-12/h4-9H2,1-3H3
40 atoms
S  2.131334 0.63853 0.079228
P  1.139855 -0.853957 -0.977161
O  0.833413 -0.206052 -2.387991
O  1.804333 -2.17011 -0.990041
N  -0.386078 -1.086567 -0.248683
N  -2.376944 -0.688464 0.623363
N  -1.110519 1.084239 -0.414301
N  -2.513524 3.077922 -0.017632
C  -0.896323 -2.402796 0.109546
C  -2.044096 -2.036863 1.043326
C  -1.328254 -0.125384 -0.015751
C  -3.477159 0.015667 1.254189
C  -3.135413 0.593624 2.619184
C  2.886197 -0.388299 1.390856
C  1.002412 1.157396 -2.806817
C  1.908627 -0.914399 2.42995
C  -0.041201 1.471876 -3.849741
C  1.072269 0.159542 3.105532
C  -1.896322 2.109159 -0.173973
H  -1.248697 -2.933875 -0.777365
H  -0.134351 -3.012636 0.587485
H  -1.733733 -2.05713 2.094221
H  -2.900769 -2.701581 0.929953
H  -3.832702 0.80125 0.591037
H  -4.294733 -0.702531 1.340244
H  -4.017482 1.065692 3.05051
H  -2.797783 -0.174675 3.315644
H  -2.362339 1.357266 2.544876
H  3.60978 0.286751 1.852134
H  3.441547 -1.198072 0.921025
H  2.012112 1.265249 -3.208003
H  0.892301 1.836162 -1.960735
H  2.497384 -1.449836 3.180491
H  1.264513 -1.66711 1.971329
H  0.454652 0.700476 2.388131
H  0.412631 -0.275351 3.856731
H  1.702227 0.894473 3.609178
H  -1.042694 1.397617 -3.428642
H  0.099004 2.493485 -4.2034
H  0.032583 0.804877 -4.707917
totalener: -1541.00818194 hartree
nucrepener: 1971.53842503 hartree
electener: -3512.54660697 hartree
oneelecener: -6032.89732670 hartree
twoeener: 2520.35071973 hartree
kineticenergy: 1536.01180388 hartree
xcener: -113.727870633804 hartree
chargesum: 0.0000000
charge: -0.179182 0.727320 -0.321032 -0.518458 -0.116950 -0.121017 -0.430206 -0.114493 -0.102065 -0.060017 0.284947 -0.074907 -0.226630 -0.112243 -0.004793 -0.124142 -0.232583 -0.249676 -0.036000 0.114157 0.120455 0.088993 0.102484 0.116694 0.080507 0.097697 0.070903 0.094273 0.114889 0.132840 0.116419 0.110363 0.084177 0.057450 0.077424 0.083901 0.092460 0.085976 0.081262 0.088803
qa: -0.1792 0.7273 -0.3210 -0.5185 -0.1170 -0.1210 -0.4302 -0.1145 -0.1021 -0.0600 0.2849 -0.0749 -0.2266 -0.1122 -0.0048 -0.1241 -0.2326 -0.2497 -0.0360 0.1142 0.1205 0.0890 0.1025 0.1167 0.0805 0.0977 0.0709 0.0943 0.1149 0.1328 0.1164 0.1104 0.0842 0.0574 0.0774 0.0839 0.0925 0.0860 0.0813 0.0888
va: 2.2648 5.5011 2.1406 2.1163 3.0633 3.2091 2.8845 3.1443 3.9457 3.9130 4.1840 3.9063 3.9039 3.9088 3.8654 3.8954 3.9336 3.9245 4.3164 1.0081 1.0048 0.9949 1.0060 1.0106 0.9980 1.0154 1.0036 1.0131 1.0025 1.0242 0.9950 0.9854 1.0125 1.0148 1.0105 1.0054 1.0082 1.0130 1.0090 1.0049
dispcorr: -0.023475678 hartree
energy: -1541.031657618424
dipole: -7.10278 6.81919 -0.28360 -1.21974 -0.34059 -1.56033 14.34965 -13.18384 1.16581
magnitude: 1.96829 au
magnitude: 5.00300 debye
