program: Orca
programVersion: 5.0.4
elementType: Cl P O O O O C C C C C C C C C H H H H H H H H H H H H
charge: 0
multiplicity: 1
keywords: wb97x-d3
keywords: def2-TZVPP
keywords: def2/J RIJCOSX
keywords: DEFGRID2
keywords: scfconv7
keywords: smallprint printgap noloewdin
keywords: NOSOSCF
formula: C9H12ClO4P
InChI: InChI=1/C9H12ClO4P/c1-12-15(11,13-2)14-9-7-5-3-4-6(7)8(9)10/h3-4,6-7H,5H2,1-2H3
27 atoms
Cl 0.571718 -0.056173 2.512033
P  -1.826378 0.255608 -0.788139
O  -0.339177 0.882766 -0.758665
O  -1.529265 -1.208538 -1.311301
O  -2.238643 -0.007065 0.721573
O  -2.722763 1.125626 -1.568346
C  1.953697 -0.257889 -1.016898
C  2.487633 -0.676703 0.397986
C  2.912807 0.815221 -1.549882
C  0.739474 0.21846 -0.278808
C  1.170444 -0.157737 0.92009
C  3.654383 0.233391 0.624336
C  3.859695 1.047505 -0.406927
C  -2.570316 -2.19075 -1.409975
C  -2.710386 1.066316 1.546054
H  1.773415 -1.081859 -1.708175
H  2.6783 -1.738362 0.56538
H  2.394384 1.731393 -1.846834
H  3.445697 0.467151 -2.43847
H  4.230131 0.231861 1.540953
H  4.622093 1.816719 -0.438662
H  -3.432156 -1.804015 -1.954071
H  -2.88184 -2.526588 -0.421236
H  -2.154633 -3.03234 -1.957704
H  -1.959992 1.85076 1.645995
H  -2.911659 0.642983 2.526251
H  -3.62954 1.492788 1.145218
elementType: Cl P O C H
totalener: -1452.78100836 hartree
nucrepener: 1344.92189021 hartree
electener: -2797.70289858 hartree
oneelecener: -4671.21526363 hartree
twoeener: 1873.51236505 hartree
cpcmener: -0.02287905 hartree
kineticenergy: 1448.51701170 hartree
xcener: -99.083646847950 hartree
chargesum: -0.0000000
charge: -0.071682 0.918552 -0.353403 -0.327658 -0.335227 -0.610435 0.082301 0.119019 -0.069557 0.058916 -0.108460 -0.224266 -0.220230 -0.112509 -0.129894 0.088530 0.087876 0.084867 0.086978 0.145993 0.137052 0.120341 0.123037 0.125735 0.122008 0.131965 0.130151
qa: -0.0717 0.9186 -0.3534 -0.3277 -0.3352 -0.6104 0.0823 0.1190 -0.0696 0.0589 -0.1085 -0.2243 -0.2202 -0.1125 -0.1299 0.0885 0.0879 0.0849 0.0870 0.1460 0.1371 0.1203 0.1230 0.1257 0.1220 0.1320 0.1302
va: 1.2601 5.6154 2.1018 2.0977 2.0627 2.0190 3.9895 3.8950 3.8912 3.8776 3.9654 3.8414 3.9424 3.8372 3.8293 1.0144 1.0104 1.0090 1.0099 1.0004 1.0007 0.9916 0.9911 0.9892 0.9901 0.9872 1.0006
dispcorr: -0.012345268 hartree
energy: -1452.793353631614
dipole: 2.99477 -2.43783 0.55694 -2.61596 1.29923 -1.31673 -5.86398 6.47105 0.60707
magnitude: 1.55322 au
magnitude: 3.94797 debye
