program: Orca
programVersion: 5.0.4
elementType: Cl P O O O O C C C C C C C C C H H H H H H H H H H H H
charge: 0
multiplicity: 1
keywords: wb97x-d3
keywords: def2-TZVPP
keywords: def2/J RIJCOSX
keywords: DEFGRID2
keywords: scfconv7
keywords: smallprint printgap noloewdin
keywords: NOSOSCF
formula: C9H12ClO4P
InChI: InChI=1/C9H12ClO4P/c1-12-15(11,13-2)14-9-7-5-3-4-6(7)8(9)10/h3-4,6-7H,5H2,1-2H3
27 atoms
Cl 1.59661 -0.633851 -2.740271
P  -1.999567 -0.215363 0.446303
O  -0.610465 -0.798046 -0.131297
O  -1.559087 0.254511 1.901967
O  -2.184494 1.19226 -0.287027
O  -3.101209 -1.170963 0.326973
C  1.216894 0.867025 0.720883
C  2.317484 0.962046 -0.39364
C  1.879246 0.215955 1.942895
C  0.504369 -0.045267 -0.239087
C  1.416352 0.056526 -1.19775
C  3.508818 0.30118 0.225651
C  3.264119 -0.116844 1.462597
C  -2.545003 0.653175 2.85087
C  -2.718715 1.235465 -1.607508
H  0.703028 1.80323 0.939954
H  2.506352 1.947588 -0.825532
H  1.337474 -0.669598 2.284842
H  1.908823 0.901863 2.793576
H  4.442091 0.161438 -0.302899
H  3.9719 -0.660051 2.075951
H  -2.036932 0.766236 3.805203
H  -3.328266 -0.098636 2.949835
H  -2.994316 1.608045 2.57361
H  -2.894465 2.282076 -1.843181
H  -3.659138 0.688394 -1.674634
H  -2.012548 0.825012 -2.331446
totalener: -1452.76486097 hartree
nucrepener: 1338.46116990 hartree
electener: -2791.22603088 hartree
oneelecener: -4657.63647004 hartree
twoeener: 1866.41043916 hartree
kineticenergy: 1448.56294831 hartree
xcener: -99.086314501468 hartree
chargesum: 0.0000000
charge: -0.060330 0.855357 -0.309568 -0.312880 -0.325106 -0.502854 0.067387 0.080267 -0.067997 0.046244 -0.104216 -0.176825 -0.178802 -0.131907 -0.117996 0.087229 0.070589 0.079169 0.072567 0.122329 0.112744 0.110059 0.126001 0.113462 0.112272 0.123299 0.109508
qa: -0.0603 0.8554 -0.3096 -0.3129 -0.3251 -0.5029 0.0674 0.0803 -0.0680 0.0462 -0.1042 -0.1768 -0.1788 -0.1319 -0.1180 0.0872 0.0706 0.0792 0.0726 0.1223 0.1127 0.1101 0.1260 0.1135 0.1123 0.1233 0.1095
va: 1.2693 5.6321 2.1452 2.1070 2.0610 2.1428 3.9792 3.9862 3.8788 3.9309 3.9371 3.8837 3.9573 3.8679 3.8679 1.0171 1.0112 1.0151 1.0108 1.0073 1.0071 0.9902 0.9939 0.9893 0.9897 0.9975 0.9889
dispcorr: -0.012537582 hartree
energy: -1452.777398554883
dipole: -1.65416 1.85586 0.20170 9.21285 -7.74738 1.46547 13.05516 -12.35183 0.70333
magnitude: 1.63797 au
magnitude: 4.16339 debye
