program: Orca
programVersion: 5.0.4
elementType: S S P O O O N C C C C C C C C C H H H H H H H H H H H H H H H H H H
charge: 0
multiplicity: 1
keywords: wb97x-d3
keywords: def2-TZVPP
keywords: def2/J RIJCOSX
keywords: DEFGRID2
keywords: scfconv7
keywords: smallprint printgap noloewdin
keywords: NOSOSCF
formula: C9H18NO3PS2
InChI: InChI=1/C9H18NO3PS2/c1-4-8(3)16-14(12,13-5-2)10-6-7-15-9(10)11/h8H,4-7H2,1-3H3
34 atoms
S  0.969405 1.291228 0.739627
S  -3.527662 -0.760374 0.693551
P  0.464201 -0.190814 -0.60386
O  1.139393 -1.492679 0.008451
O  0.773502 0.103017 -2.025362
O  -1.145281 -0.939307 1.812805
N  -1.215082 -0.432519 -0.423754
C  -2.163078 0.062532 -1.425572
C  2.397516 2.076392 -0.146053
C  -3.485769 -0.617446 -1.116311
C  2.6246 3.437434 0.500934
C  -1.765299 -0.736177 0.795391
C  3.627458 1.193707 -0.078842
C  1.481813 4.423222 0.321974
C  0.982911 -2.776313 -0.65085
C  0.744077 -3.833286 0.394404
H  -1.831358 -0.197297 -2.427807
H  -2.253375 1.148729 -1.352712
H  2.086055 2.221901 -1.181175
H  -4.327471 -0.022657 -1.462134
H  -3.543853 -1.61157 -1.556502
H  2.861547 3.311349 1.560872
H  3.527001 3.844071 0.037366
H  4.455503 1.685567 -0.591713
H  3.472319 0.229451 -0.561549
H  3.928805 1.01194 0.953259
H  1.234973 4.55169 -0.733439
H  0.575204 4.104641 0.837284
H  1.754354 5.401114 0.719286
H  0.158167 -2.748614 -1.365666
H  1.898974 -2.968455 -1.208927
H  0.659692 -4.803556 -0.093883
H  1.568981 -3.888452 1.104261
H  -0.179855 -3.653408 0.943287
elementType: S P O N C H
totalener: -1772.20552264 hartree
nucrepener: 1681.26097157 hartree
electener: -3453.46649421 hartree
oneelecener: -5783.07414579 hartree
twoeener: 2329.60765158 hartree
cpcmener: -0.03900572 hartree
kineticenergy: 1767.23977011 hartree
xcener: -116.184713483266 hartree
chargesum: -0.0000000
charge: -0.201493 -0.051468 0.787826 -0.347024 -0.644755 -0.461003 -0.146853 -0.078536 0.068633 -0.115153 -0.100642 0.275611 -0.270933 -0.266406 0.038018 -0.249217 0.116766 0.127740 0.085551 0.126960 0.122054 0.080084 0.079588 0.099573 0.091788 0.092049 0.083761 0.077338 0.095192 0.100468 0.112328 0.095100 0.092021 0.085034
qa: -0.2015 -0.0515 0.7878 -0.3470 -0.6448 -0.4610 -0.1469 -0.0785 0.0686 -0.1152 -0.1006 0.2756 -0.2709 -0.2664 0.0380 -0.2492 0.1168 0.1277 0.0856 0.1270 0.1221 0.0801 0.0796 0.0996 0.0918 0.0920 0.0838 0.0773 0.0952 0.1005 0.1123 0.0951 0.0920 0.0850
va: 2.3069 2.3920 5.3998 2.0717 1.9526 2.0156 3.1069 3.9262 3.8444 3.9539 3.8517 4.3036 3.9396 3.9484 3.8575 3.9544 1.0119 1.0027 1.0384 1.0105 1.0083 1.0124 1.0065 1.0049 1.0205 1.0080 1.0010 1.0102 1.0042 0.9961 0.9957 1.0076 1.0022 1.0073
dispcorr: -0.016097435 hartree
energy: -1772.221620077035
dipole: 14.87697 -15.43550 -0.55853 6.45916 -6.44315 0.01601 -5.19584 3.46803 -1.72781
magnitude: 1.81591 au
magnitude: 4.61568 debye
