program: Orca
programVersion: 5.0.4
elementType: S S P O O O N C C C C C C C C C H H H H H H H H H H H H H H H H H H
charge: 0
multiplicity: 1
keywords: wb97x-d3
keywords: def2-TZVPP
keywords: def2/J RIJCOSX
keywords: DEFGRID2
keywords: scfconv7
keywords: smallprint printgap noloewdin
keywords: NOSOSCF
formula: C9H18NO3PS2
InChI: InChI=1/C9H18NO3PS2/c1-4-8(3)16-14(12,13-5-2)10-6-7-15-9(10)11/h8H,4-7H2,1-3H3
34 atoms
S  1.916782 0.446523 0.851863
S  -3.175103 -0.033299 0.762237
P  0.826698 -0.656506 -0.51154
O  1.070431 -2.094587 0.11705
O  1.173448 -0.455981 -1.941197
O  -0.936897 -0.816499 1.921866
N  -0.845141 -0.351285 -0.322237
C  -1.64922 0.244253 -1.390067
C  2.056372 2.066426 -0.03409
C  -3.09805 -0.060421 -1.050796
C  0.836961 2.937409 0.240724
C  -1.463645 -0.468323 0.892272
C  3.361551 2.688998 0.433116
C  0.847162 4.227571 -0.567292
C  0.862649 -3.307091 -0.648695
C  -0.582681 -3.547958 -1.008892
H  -1.391381 -0.18916 -2.352428
H  -1.477361 1.320748 -1.432726
H  2.127144 1.842005 -1.0995
H  -3.76819 0.688175 -1.465458
H  -3.399315 -1.044486 -1.40566
H  -0.072333 2.382466 0.002285
H  0.789685 3.162327 1.30938
H  3.531494 3.629986 -0.090068
H  4.212453 2.041635 0.225717
H  3.343475 2.903607 1.502847
H  0.932454 4.023557 -1.635998
H  -0.079614 4.779653 -0.411208
H  1.668481 4.886454 -0.286727
H  1.491224 -3.277547 -1.539701
H  1.235732 -4.098615 -0.002591
H  -1.229203 -3.506778 -0.132219
H  -0.951918 -2.841209 -1.752551
H  -0.666662 -4.546141 -1.439386
elementType: S P O N C H
totalener: -1772.20360622 hartree
nucrepener: 1704.65716810 hartree
electener: -3476.86077432 hartree
oneelecener: -5829.36149496 hartree
twoeener: 2352.50072064 hartree
cpcmener: -0.04102586 hartree
kineticenergy: 1767.23738941 hartree
xcener: -116.187528668152 hartree
chargesum: 0.0000000
charge: -0.185689 -0.060236 0.779598 -0.356375 -0.637656 -0.456803 -0.137234 -0.101130 0.059198 -0.106438 -0.088878 0.276956 -0.285406 -0.289153 0.034659 -0.262478 0.123620 0.135331 0.086650 0.128987 0.121938 0.058324 0.075546 0.101883 0.104630 0.101118 0.087364 0.096519 0.090291 0.103079 0.110828 0.090781 0.089671 0.110504
qa: -0.1857 -0.0602 0.7796 -0.3564 -0.6377 -0.4568 -0.1372 -0.1011 0.0592 -0.1064 -0.0889 0.2770 -0.2854 -0.2892 0.0347 -0.2625 0.1236 0.1353 0.0867 0.1290 0.1219 0.0583 0.0755 0.1019 0.1046 0.1011 0.0874 0.0965 0.0903 0.1031 0.1108 0.0908 0.0897 0.1105
va: 2.3037 2.3719 5.3987 2.1090 1.9554 2.0243 3.0404 3.9174 3.8336 3.9391 3.8752 4.2977 3.9254 3.9621 3.8540 3.9216 1.0121 0.9954 1.0381 1.0112 1.0083 1.0172 1.0189 0.9981 1.0117 1.0018 0.9987 1.0029 0.9998 1.0010 0.9888 1.0050 1.0044 1.0092
dispcorr: -0.017951657 hartree
energy: -1772.221557879845
dipole: 4.38722 -5.59396 -1.20674 11.71360 -11.04181 0.67180 -9.90660 7.96141 -1.94519
magnitude: 2.38564 au
magnitude: 6.06383 debye
