program: Orca
programVersion: 5.0.4
elementType: S S P O O O N C C C C C C C C C H H H H H H H H H H H H H H H H H H
charge: 0
multiplicity: 1
keywords: wb97x-d3
keywords: def2-TZVPP
keywords: def2/J RIJCOSX
keywords: DEFGRID2
keywords: scfconv7
keywords: smallprint printgap noloewdin
keywords: NOSOSCF
formula: C9H18NO3PS2
InChI: InChI=1/C9H18NO3PS2/c1-4-8(3)16-14(12,13-5-2)10-6-7-15-9(10)11/h8H,4-7H2,1-3H3
34 atoms
S  1.604016 0.616746 1.104586
S  -3.344677 -0.48612 0.806439
P  0.719535 -0.503818 -0.393257
O  1.072833 -1.975444 0.08923
O  1.102386 -0.125028 -1.775924
O  -1.034218 -1.073465 1.950514
N  -0.978584 -0.390409 -0.233676
C  -1.824719 0.252225 -1.237303
C  2.271357 2.035982 0.117377
C  -3.229191 -0.273666 -0.994171
C  1.164296 3.003542 -0.281508
C  -1.594363 -0.706403 0.943579
C  3.34087 2.666704 0.994056
C  1.66614 4.1211 -1.187485
C  0.953634 -3.116515 -0.799602
C  -0.463832 -3.424452 -1.216942
H  -1.49496 -0.001794 -2.24095
H  -1.786508 1.336611 -1.119126
H  2.740527 1.613144 -0.771454
H  -3.983343 0.430703 -1.335981
H  -3.392172 -1.234981 -1.478547
H  0.372161 2.462922 -0.804119
H  0.710934 3.422894 0.620283
H  4.115291 1.949029 1.262381
H  2.919056 3.079782 1.911487
H  3.825674 3.481052 0.455945
H  2.385894 4.769467 -0.6881
H  2.14391 3.719849 -2.083018
H  0.835491 4.74804 -1.511824
H  1.591424 -2.954108 -1.669436
H  1.371661 -3.9425 -0.228502
H  -0.456572 -4.366271 -1.76681
H  -1.122814 -3.545886 -0.357042
H  -0.883494 -2.667249 -1.879557
elementType: S P O N C H
totalener: -1772.20342819 hartree
nucrepener: 1697.18459308 hartree
electener: -3469.38802127 hartree
oneelecener: -5814.64648176 hartree
twoeener: 2345.25846048 hartree
cpcmener: -0.03973472 hartree
kineticenergy: 1767.23452977 hartree
xcener: -116.186730753021 hartree
chargesum: 0.0000000
charge: -0.195912 -0.059572 0.778554 -0.358607 -0.637914 -0.463359 -0.124059 -0.097600 0.082099 -0.113897 -0.096226 0.276666 -0.286935 -0.286802 0.029335 -0.261155 0.122277 0.134614 0.084115 0.130458 0.123553 0.062414 0.070857 0.104710 0.100569 0.102513 0.090423 0.087283 0.095833 0.102755 0.112000 0.111421 0.090766 0.088825
qa: -0.1959 -0.0596 0.7786 -0.3586 -0.6379 -0.4634 -0.1241 -0.0976 0.0821 -0.1139 -0.0962 0.2767 -0.2869 -0.2868 0.0293 -0.2612 0.1223 0.1346 0.0841 0.1305 0.1236 0.0624 0.0709 0.1047 0.1006 0.1025 0.0904 0.0873 0.0958 0.1028 0.1120 0.1114 0.0908 0.0888
va: 2.2984 2.3751 5.3882 2.1076 1.9462 2.0157 3.0543 3.9203 3.8125 3.9504 3.8954 4.3066 3.9302 3.9575 3.8634 3.9244 1.0090 0.9967 1.0366 1.0100 1.0075 1.0156 1.0175 1.0108 1.0027 0.9975 0.9994 0.9997 1.0033 1.0001 0.9887 1.0093 1.0047 1.0048
dispcorr: -0.017447278 hartree
energy: -1772.220875468246
dipole: 8.22363 -9.15337 -0.92974 11.96653 -11.37407 0.59246 -12.10280 9.97964 -2.12316
magnitude: 2.39233 au
magnitude: 6.08082 debye
